program: Gaussian 09
title: 000030301
version: EM64L-G09RevD.01
frameworkgroup: C1[X(C16H25NO2)]
method: RPBEPBE
basis: SDD
operation: Freq
keyword: #p
keyword: freq=noraman
keyword: PBEPBE/SDD
title: #p freq=noraman PBEPBE/SDD
converged: YES YES NO NO
title: Mulliken charges:
elementType: O O N C C C C C C C C C C C C C C C C H H H H H H H H H H H H H H H H H H H H H H H H H
charge: -0.220732 -0.215765 -0.124466 -0.049657 -0.025075 -0.406896 -0.693701 -0.686558 -0.708465 -0.690462 -0.266040 0.273118 0.157007 -0.359344 -0.309610 -0.226481 0.129473 -0.276213 -0.794344 0.184896 0.185629 0.237612 0.186421 0.208623 0.214314 0.212638 0.230454 0.203769 0.205314 0.215404 0.208645 0.227421 0.210152 0.183992 0.278811 0.199397 0.214534 0.253883 0.244681 0.228536 0.231079 0.232483 0.236397 0.259126
chargesum: 0.00000
title: Mulliken charges with hydrogens summed into heavy atoms:
elementType: O O N C C C C C C C C C C C C C C C C
charge: -0.220732 -0.215765 -0.124466 0.135239 0.160554 0.017137 -0.058126 -0.047020 -0.056995 -0.017507 0.147891 0.273118 0.157007 -0.105461 -0.064929 0.002055 0.129473 -0.045134 -0.066338
polarizability: 2.34326434e+02 -5.64384539e+00 2.09115441e+02 1.79224009e+01 2.16990586e+00 1.33281739e+02
1716.lowfreq: -11.5075 -0.0006 -0.0005 0.0002 4.8559 8.2194 18.1566 26.2889 35.3704
frequency: 17.2794 26.1471 35.2882 53.4262 68.5684 85.7135 95.2603 105.8266 116.3101 151.3420 182.8126 192.8891 210.1798 218.3554 229.5001 239.0793 244.2537 252.2555 273.8633 290.5379 315.6896 338.6686 352.0164 374.3317 388.1991 424.1547 437.4992 475.6587 501.0376 516.0831 530.4770 548.7394 572.3798 597.6668 607.6192 668.0829 702.7966 743.1331 757.6210 768.1767 826.1573 851.7786 865.6288 888.1950 904.0290 908.8100 924.6121 929.4850 938.1865 941.5795 947.9512 970.6017 979.7987 1019.3998 1022.4707 1037.4597 1063.8110 1066.9560 1086.8261 1119.5745 1126.9277 1136.6725 1141.0051 1163.9284 1178.9206 1184.2282 1209.5108 1228.4849 1233.5085 1247.7782 1281.9534 1293.6132 1296.6533 1302.8071 1352.5826 1363.9392 1365.9540 1368.6595 1370.7996 1379.4889 1382.2030 1385.9957 1390.7345 1399.6456 1426.8456 1445.5947 1451.3952 1455.2837 1458.7236 1462.2971 1467.2844 1468.6131 1473.4841 1478.5789 1479.6381 1482.8359 1486.8116 1492.9405 1564.5090 1595.9735 1606.3360 2882.3082 2950.6998 2959.2929 2970.4459 2975.0563 2979.2117 2979.5397 2984.7436 2998.8594 3023.3035 3063.3787 3063.8029 3068.4874 3069.5709 3073.1540 3074.0858 3075.7652 3084.4896 3090.1609 3093.0559 3122.2965 3132.7741 3150.5990 3167.3174 3176.0657
redmass: 3.3619 4.3290 3.9863 3.7881 3.4466 2.7212 4.4991 3.8465 4.1313 3.1745 1.0987 2.1486 1.1230 1.2501 3.8019 2.4302 2.4879 1.3251 1.0585 2.0852 2.6486 3.4827 2.8424 2.9727 2.6703 3.3680 3.0366 2.7255 3.5629 3.0988 3.5039 2.4117 3.9487 2.8105 5.4188 2.6532 4.4751 2.8928 1.3590 4.1313 2.6663 1.4983 2.4512 3.2357 1.2630 1.3620 1.3798 1.2807 2.0942 1.5790 1.8588 2.6343 1.3329 1.8080 2.1432 3.1075 1.7530 1.9451 2.3064 2.2425 2.2799 1.7804 1.9402 1.9913 1.0884 1.7430 2.4954 2.3159 1.7177 3.9401 1.5043 1.2645 1.3418 1.3128 1.4447 1.3380 1.2368 1.2265 1.3408 1.5764 1.2447 2.5836 1.2879 1.2159 2.1099 1.0868 1.1372 1.1767 1.0528 1.0491 1.0532 1.0599 1.0725 1.0695 1.8163 1.0539 1.0515 1.0579 5.9822 7.6034 6.2389 1.0708 1.0583 1.0819 1.0349 1.0361 1.0358 1.0363 1.0375 1.0834 1.1051 1.0905 1.0990 1.0970 1.0994 1.0969 1.0985 1.0991 1.0997 1.1000 1.0996 1.0994 1.0861 1.0898 1.0934 1.0985
irintensity: 0.5480 1.8830 1.8034 2.7658 0.0914 0.6693 2.4081 0.6557 0.6787 2.4634 0.7470 1.4742 0.1379 0.6330 2.2348 0.9057 0.4252 0.9311 0.0530 0.2190 0.1662 1.3756 1.3062 0.6764 1.2150 0.8326 3.1318 8.1565 2.3709 6.2476 9.3424 3.2280 16.9160 2.4269 20.6421 2.4499 5.4322 3.3076 92.3711 0.6166 3.4434 0.8413 11.1821 28.0685 1.2256 2.6350 5.4701 1.4685 38.1761 7.5886 16.4238 31.4103 0.3081 3.6537 20.3296 5.7652 1.1833 14.4883 29.5321 0.9782 40.1855 25.6734 10.0791 29.1516 20.8492 49.1972 57.4766 221.3739 42.5644 160.7056 33.7338 20.6363 11.8213 4.4901 6.0912 11.9393 55.5639 3.4125 11.3822 26.4433 12.1586 3.9048 28.4095 13.6625 45.6449 4.9584 71.0687 14.1854 0.0211 2.2175 18.0152 9.6812 15.0276 11.0963 47.9761 1.4954 19.9853 14.0517 96.1687 56.4580 164.6874 64.4935 45.8155 53.0364 29.1201 25.6297 34.4718 17.3250 5.9268 28.1404 39.7257 10.6176 11.2963 29.4379 40.1671 15.6650 34.0099 121.2560 24.7399 46.6095 24.8694 14.4482 3.9497 12.4850 26.8476 11.4393
temp: 298.150 k
press: 1.00000 atm
elementType: 8 8 7 6 6 6 6 6 6 6 6 6 6 6 6 6 6 6 6 1 1 1 1 1 1 1 1 1 1 1 1 1 1 1 1 1 1 1 1 1 1 1 1 1
symmnumber: 1
zpe: 988676.7 jmol-1
zpe.correction: 0.376567 hartree
zpe.thermalcorrener: 0.398085 hartree
zpe.thermalcorrenthalpy: 0.399029 hartree
zpe.thermalcorrgfe: 0.324954 hartree
zpe.sumelectzpe: -828.383954 hartree
zpe.sumelectthermal: -828.362437 hartree
zpe.sumelectthermalent: -828.361492 hartree
zpe.sumelectthermalfe: -828.435567 hartree
dipole: 0.6729 -3.1501 0.3648
dipole: 3.2418
quadrupole: -99.7919 -111.7984 -118.1866
quadrupole: 0.6031 4.4544 4.9085
quadrupole: 10.1337 -1.8728 -8.2609 0.6031 4.4544 4.9085
hfenergy: -828.7605212 hartree
pointgroup: C01[X(C16H25N1O2)]
dipole: -0.7179182 0.5438138 0.9030631 debye
polarizability: 235.4764229|13.2815246|169.4845448|-3.9016827|39.1018403|171.7626459 unknown
InChI: InChI=1S/C16H25NO2/c1-12(2)17(13(3)4)10-11-19-16-9-7-6-8-15(16)14(5)18/h6-9,12-13H,10-11H2,1-5H3
charge 0 multiplicity 1
44 atoms
O  -0.453714 0.457755 -0.326857
O  -0.435809 -1.254616 -2.429788
N  2.416817 0.537318 0.930585
C  2.848029 0.991785 2.279755
C  3.300091 -0.401097 0.179034
C  1.661833 1.533423 0.157747
C  4.185975 1.790751 2.299056
C  2.889202 -0.175087 3.294945
C  4.253315 0.277452 -0.851071
C  2.464674 -1.510208 -0.502811
C  0.155012 1.547703 0.467803
C  -1.814309 0.220296 -0.212848
C  -2.383139 -0.823862 -1.026963
C  -2.64305 0.950869 0.68305
C  -3.770682 -1.099399 -0.869698
C  -4.015503 0.655203 0.794587
C  -1.589882 -1.598927 -2.040411
C  -4.588966 -0.378449 0.020675
C  -2.229453 -2.858672 -2.642185
H  2.051152 1.684784 2.624264
H  3.941132 -0.883979 0.94212
H  1.76371 1.332872 -0.922903
H  2.046194 2.568803 0.32505
H  4.373669 2.215747 3.303262
H  5.039681 1.135586 2.045376
H  4.163859 2.624796 1.57271
H  1.925765 -0.713814 3.295367
H  3.089427 0.204676 4.314361
H  3.687094 -0.900069 3.049509
H  4.968404 -0.46677 -1.24912
H  3.692357 0.681502 -1.714105
H  4.830003 1.100814 -0.393613
H  1.908399 -2.086531 0.257474
H  3.118804 -2.20229 -1.067849
H  1.719682 -1.088893 -1.200439
H  -0.30447 2.511337 0.160289
H  -0.024104 1.378014 1.548193
H  -2.218233 1.749478 1.296449
H  -4.22194 -1.891846 -1.473906
H  -4.635049 1.232192 1.490454
H  -5.654278 -0.613768 0.107392
H  -3.075987 -2.599405 -3.3062
H  -2.607576 -3.545601 -1.863976
H  -1.463836 -3.371874 -3.243761
