program: Orca
programVersion: 4.2.1
elementType: Cl Cl O O N N N C C C C C C C C C C C C C C H H H H H H H H H H H H H H H
charge: 0
multiplicity: 1
keywords: wb97x-d3
keywords: def2-TZVPP
keywords: def2/J RIJCOSX GRIDX6 NOFINALGRIDX
keywords: grid4 nofinalgrid
keywords: scfconv7
keywords: smallprint printgap noloewdin
keywords: NOSOSCF
formula: C14H15Cl2N3O2
InChI: InChI=1S/C14H15Cl2N3O2/c1-2-11-6-20-14(21-11,7-19-9-17-8-18-19)12-4-3-10(15)5-13(12)16/h3-5,8-9,11H,2,6-7H2,1H3
36 atoms
Cl 0.505139 0.227659 2.858845
Cl 3.781483 2.630557 -0.587061
O  -2.037408 -0.572097 -0.790708
O  -2.050922 -0.037574 1.397213
N  0.043421 -2.557704 -0.266492
N  1.361044 -2.524183 -0.0464
N  0.934742 -3.163897 -2.1536
C  -1.255537 -0.568539 0.372126
C  -3.206387 0.219508 -0.573121
C  -3.388046 0.058238 0.924944
C  -0.888838 -2.027807 0.69691
C  -0.001415 0.274737 0.172653
C  -3.025259 1.656863 -1.036762
C  -4.329136 2.439064 -0.985284
C  0.83908 0.657118 1.214969
C  0.383964 0.631124 -1.11588
C  1.997728 1.385601 0.993624
C  1.537581 1.352869 -1.368789
C  -0.191474 -2.928784 -1.525955
C  2.335361 1.727751 -0.303531
C  1.846573 -2.896732 -1.199717
H  -4.021161 -0.248795 -1.129662
H  -3.866519 0.90866 1.409932
H  -3.9570 -0.844309 1.168331
H  -1.791645 -2.638859 0.701477
H  -0.429053 -2.103166 1.678641
H  -2.267716 2.158684 -0.428238
H  -2.647717 1.64671 -2.062076
H  -4.180956 3.458532 -1.340822
H  -5.095441 1.980349 -1.612265
H  -4.728057 2.506307 0.028048
H  -0.229109 0.340779 -1.956236
H  2.626047 1.67688 1.823502
H  1.803251 1.61238 -2.383697
H  -1.183054 -3.032406 -1.93477
H  2.909155 -2.987579 -1.360247
elementType: Cl O N C H
totalener: -1777.71625355 hartree
nucrepener: 2066.02281082 hartree
electener: -3843.73906437 hartree
oneelecener: -6546.19474622 hartree
twoeener: 2702.45568184 hartree
cpcmener: -0.02820448 hartree
kineticenergy: 1772.83088141 hartree
xcener: -124.643696284988 hartree
chargesum: -0.0000000
charge: -0.075929 -0.086127 -0.411409 -0.384597 0.107815 -0.334275 -0.409886 0.612225 0.159423 0.017262 -0.113768 -0.109868 -0.142194 -0.275002 -0.043419 -0.117492 -0.145399 -0.198905 0.060300 0.123264 0.058639 0.099896 0.100487 0.091561 0.134736 0.125004 0.074666 0.070561 0.094849 0.085560 0.080419 0.152305 0.121829 0.147090 0.169665 0.160714
qa: -0.0759 -0.0861 -0.4114 -0.3846 0.1078 -0.3343 -0.4099 0.6122 0.1594 0.0173 -0.1138 -0.1099 -0.1422 -0.2750 -0.0434 -0.1175 -0.1454 -0.1989 0.0603 0.1233 0.0586 0.0999 0.1005 0.0916 0.1347 0.1250 0.0747 0.0706 0.0948 0.0856 0.0804 0.1523 0.1218 0.1471 0.1697 0.1607
va: 1.2454 1.2176 1.9832 1.9939 3.3671 2.8863 3.0289 3.7821 3.9318 3.9875 3.8960 3.4674 3.9119 3.9589 4.0292 3.8110 4.0962 4.0953 4.0719 3.8498 4.0461 0.9986 0.9939 0.9982 1.0078 1.0311 1.0021 1.0130 1.0016 1.0012 1.0047 1.0217 1.0245 1.0058 1.0068 0.9966
dispcorr: -0.021525191 hartree
energy: -1777.737778741473
dipole: -31.32043 28.52750 -2.79293 0.11798 0.37350 0.49147 -10.11273 9.99364 -0.11909
magnitude: 2.83834 au
magnitude: 7.21450 debye
