program: Gaussian 09
title: 000030220
version: EM64L-G09RevD.01
frameworkgroup: C1[X(C7H16O2)]
method: RPBEPBE
basis: SDD
operation: Freq
keyword: #pfreq=noraman
keyword: PBEPBE/SDD
title: #p freq=noraman PBEPBE/SDD
converged: YES YES NO NO
title: Mulliken charges:
elementType: O O C C C C C C C H H H H H H H H H H H H H H H H
charge: -0.258442 -0.276744 0.097569 -0.214257 -0.386444 -0.693915 -0.225879 -0.681887 -0.672656 0.153202 0.169394 0.216527 0.209511 0.218004 0.244545 0.204403 0.222803 0.190326 0.184971 0.206385 0.223445 0.210455 0.201488 0.225245 0.231953
chargesum: 0.00000
title: Mulliken charges with hydrogens summed into heavy atoms:
elementType: O O C C C C C C C
charge: -0.258442 -0.276744 0.250771 0.171664 0.041070 -0.022164 0.149418 -0.041602 -0.013970
polarizability: 1.01242990e+02 -1.90954296e-01 8.67749229e+01 9.80513334e-01 -2.54259715e-01 7.09480077e+01
1716.lowfreq: -9.5721 -0.4964 -0.0008 -0.0005 0.0003 8.6898 37.2922 51.3590 52.5293
frequency: 37.1699 50.9715 52.4025 74.6801 130.1759 157.3092 187.3325 214.7705 223.6730 240.1057 271.9247 302.8075 365.8579 459.5583 496.7275 541.6457 762.0234 787.1220 817.4130 854.0075 888.2031 898.2339 914.0983 992.7734 1043.7447 1054.3727 1062.5528 1099.8377 1117.5843 1124.7623 1137.3609 1142.1210 1160.3680 1221.4879 1252.0263 1275.5049 1295.8646 1324.3270 1331.5271 1374.3685 1382.6482 1388.6648 1392.9451 1398.1260 1456.3108 1458.8345 1465.3938 1474.7984 1478.6553 1479.4580 1483.4564 1493.2782 1494.5215 2859.5520 2917.5261 2921.6338 2966.7152 2975.3274 2993.5046 2999.5538 3000.3262 3017.2836 3049.0756 3077.4317 3079.1413 3091.0175 3097.3769 3101.1057 3113.6996
redmass: 3.0939 1.6770 1.7910 2.7130 3.2641 2.8463 1.2566 1.2911 1.5368 1.2137 2.8126 3.8551 3.3725 2.9961 3.6030 3.6209 1.0813 2.5684 1.1034 2.5168 1.1393 1.7985 2.7396 4.3429 3.3677 2.6662 2.2279 2.0607 2.6833 2.0817 1.4834 1.4611 2.3378 1.3008 1.1526 1.1099 1.2542 1.2028 1.3474 1.3783 1.2679 1.2741 1.2618 1.3276 1.0443 1.0409 1.0505 1.0585 1.0476 1.0418 1.0733 1.0837 1.0818 1.0832 1.0577 1.0631 1.1056 1.0359 1.0358 1.0370 1.0598 1.0935 1.1013 1.1021 1.0995 1.0991 1.0999 1.1009 1.1002
irintensity: 1.2602 0.1522 1.2040 1.4026 0.7311 8.9900 0.6484 0.6385 1.0135 0.1985 0.9064 6.2975 2.2253 1.3631 4.4213 2.7138 8.5766 33.4523 3.4572 30.2194 2.3585 7.9962 71.6333 102.9860 112.8804 9.0865 96.0239 31.3726 80.2547 14.5271 8.2563 6.4349 21.1514 2.2507 0.5864 1.3084 9.3340 36.9133 33.3437 0.0788 19.9818 39.8997 9.6240 9.3789 9.1787 10.4242 3.1570 2.9905 6.0654 13.0270 1.8381 13.8076 5.7163 66.2221 33.2265 111.0600 62.7904 38.5234 26.2934 14.0033 26.2812 24.2768 0.9082 82.9286 55.1948 37.6464 30.9710 38.2377 21.6659
temp: 298.150 k
press: 1.00000 atm
elementType: 8 8 6 6 6 6 6 6 6 1 1 1 1 1 1 1 1 1 1 1 1 1 1 1 1
symmnumber: 1
zpe: 579268.7 jmol-1
zpe.correction: 0.220632 hartree
zpe.thermalcorrener: 0.233015 hartree
zpe.thermalcorrenthalpy: 0.233959 hartree
zpe.thermalcorrgfe: 0.180932 hartree
zpe.sumelectzpe: -425.992290 hartree
zpe.sumelectthermal: -425.979907 hartree
zpe.sumelectthermalent: -425.978963 hartree
zpe.sumelectthermalfe: -426.031990 hartree
dipole: 0.8068 -0.8820 2.1060
dipole: 2.4216
quadrupole: -51.8687 -56.9014 -57.6022
quadrupole: 1.2512 1.8337 0.5858
quadrupole: 3.5887 -1.4439 -2.1448 1.2512 1.8337 0.5858
hfenergy: -426.2129219 hartree
pointgroup: C01 [X(C7H16O2)]
dipole: 0.3377592 -0.2831037 0.8446814 debye
dipolederiv: -1.3155106 -0.2130401 0.0199216 -0.3370936 -0.6283249 0.0066066 -0.0368238 -0.010739 -0.3915183 -1.0273598 0.3562475 -0.0412573 0.5321321 -0.8909271 0.0959231 0.0303125 -0.0174168 -0.41859 1.4505292 -0.0161466 -0.0107627 -0.3529536 0.9538795 -0.0370615 -0.0417042 0.1733798 0.5564065 0.5574908 0.152146 -0.0743506 0.3621052 0.4380463 0.0061718 -0.1814593 0.000427 0.3918733 0.0103954 -0.0527421 -0.0157885 -0.0629813 0.076965 0.0327144 0.0005585 0.0321124 0.1153892 -0.102755 -0.1029201 0.0271953 -0.0659426 -0.1981398 0.0560688 0.0583157 0.070685 0.0095351 0.705632 -0.2147279 0.0799361 -0.1538423 0.4504237 -0.1211716 0.2178746 -0.21326 0.3897145 -0.0332256 -0.0699485 0.0063695 -0.021056 0.0310386 0.0293355 -0.0253325 0.0169301 0.0884839 -0.0013505 0.0698309 0.0320256 0.0823198 -0.0746991 -0.0509421 0.0156324 -0.0459145 0.0424887 -0.0742539 -0.0183857 0.0024545 0.0530052 -0.0419327 0.0886076 -0.0285282 -0.0320207 -0.2639129 -0.007481 -0.0284058 -0.0352838 -0.0703958 0.0038937 -0.0011072 0.0262318 0.0550777 -0.2322266 0.0200416 0.0628042 0.0226317 -0.0032338 -0.1473957 -0.0270793 0.041785 -0.0551684 0.0276129 0.0070472 0.0559397 0.0226848 0.0888435 -0.1262405 -0.0542008 0.0314758 -0.0793821 0.05671 0.0560865 -0.0204977 0.0175437 -0.0048478 0.0698746 0.0215575 -0.0158369 0.0335286 -0.1615262 0.1145507 0.0053535 -0.0288603 -0.0133225 0.0938793 -0.0165101 -0.0062561 0.0371455 -0.1011956 -0.1594192 -0.0493055 -0.0546606 -0.012398 0.0902736 0.0128662 -0.0684655 0.0029425 0.0753754 0.054959 0.1055888 0.0538796 0.0925048 -0.082021 -0.0599226 0.0484825 -0.0755796 0.057863 -0.1628322 -0.0673043 -0.0592638 -0.1381585 -0.1104228 -0.0476058 -0.0739538 0.008216 0.0265967 -0.0396349 0.0236445 0.1204668 0.0262736 0.0080434 0.0324806 0.016312 0.0878984 -0.2079854 0.0986143 -0.0084635 -0.0146445 -0.0216912 0.0639334 0.0055617 0.0410133 0.0462181 -0.1905857 -0.1977103 -0.020511 -0.0724765 -0.0003374 0.0786516 0.0162132 -0.0878967 0.0094956 0.0722855 0.0601964 0.1087866 0.0497546 0.0449218 -0.1321993 -0.060649 0.0446306 -0.0779919 0.0544655 -0.066975 0.1113806 -0.0984975 0.103546 0.0305493 0.0344961 -0.1203132 0.0594587 0.014473 -0.0214052 -0.1509884 -0.0219781 -0.0995349 -0.0290488 -0.0269917 0.0060096 -0.0389164 0.0881136 0.07437 -0.0183349 0.0729605 -0.0278627 0.0719 0.0646387 0.1079359 0.0128743 -0.0998463 unknown
polarizability: 101.25973|0.2986586|86.6821728|0.6163925|-1.2437316|71.024018 unknown
InChI: InChI=1S/C7H16O2/c1-4-6-9-7(3)8-5-2/h7H,4-6H2,1-3H3
charge 0 multiplicity 1
25 atoms
O  -0.670808 1.014218 -0.255748
O  1.411938 -0.098777 -0.403945
C  0.69887 1.058169 0.182126
C  -1.414089 -0.167451 0.227795
C  -2.857358 -0.037807 -0.267113
C  1.29089 2.376866 -0.308623
C  2.486788 -0.631036 0.448431
C  -3.729114 -1.230348 0.18392
C  3.045297 -1.874109 -0.244371
H  0.751361 0.961077 1.297094
H  -1.377761 -0.19614 1.341441
H  -0.93516 -1.085996 -0.163585
H  -3.282186 0.9124 0.107889
H  -2.844558 0.031076 -1.370961
H  1.202431 2.424998 -1.406494
H  2.357836 2.44746 -0.033057
H  0.750107 3.232344 0.131709
H  3.285318 0.131256 0.584392
H  2.081686 -0.884073 1.454484
H  -3.771561 -1.304042 1.287264
H  -4.764657 -1.12326 -0.185465
H  -3.330931 -2.187268 -0.203169
H  3.861158 -2.317975 0.355115
H  2.25278 -2.630864 -0.37713
H  3.441925 -1.61362 -1.240598
