program: Orca
programVersion: 4.2.1
elementType: Cl Cl O O N N N C C C C C C C C C C C C C C H H H H H H H H H H H H H H H
charge: 0
multiplicity: 1
keywords: wb97x-d3
keywords: def2-TZVPP
keywords: def2/J RIJCOSX GRIDX6 NOFINALGRIDX
keywords: grid4 nofinalgrid
keywords: scfconv7
keywords: smallprint printgap noloewdin
keywords: NOSOSCF
formula: C14H15Cl2N3O2
InChI: InChI=1S/C14H15Cl2N3O2/c1-2-11-6-20-14(21-11,7-19-9-17-8-18-19)12-4-3-10(15)5-13(12)16/h3-5,8-9,11H,2,6-7H2,1H3
36 atoms
Cl 0.157234 0.109179 -2.019769
Cl 3.632267 2.974139 0.795303
O  -2.026703 -0.573074 -0.248396
O  -1.863304 -0.536882 1.968079
N  0.105495 -2.656979 -0.251729
N  1.433579 -2.515793 -0.275393
N  0.702592 -3.408985 -2.19987
C  -1.126311 -0.764856 0.798839
C  -3.015552 0.372737 0.16504
C  -2.748286 0.528442 1.668808
C  -0.690783 -2.232145 0.866552
C  0.068067 0.189271 0.725245
C  -2.933367 1.680686 -0.599678
C  -4.046046 2.629327 -0.174964
C  0.677732 0.619497 -0.451961
C  0.624304 0.631388 1.923736
C  1.767281 1.479532 -0.435702
C  1.715237 1.480769 1.969413
C  -0.312755 -3.179011 -1.405623
C  2.274847 1.904724 0.777575
C  1.740492 -2.974435 -1.46001
H  -3.992864 -0.086687 -0.011286
H  -2.286335 1.495531 1.900431
H  -3.642156 0.419495 2.28042
H  -1.581206 -2.85915 0.911061
H  -0.11735 -2.399261 1.776978
H  -1.959221 2.149243 -0.43167
H  -3.010424 1.480861 -1.670107
H  -5.030379 2.195463 -0.358938
H  -3.989652 2.87855 0.886461
H  -3.990857 3.566507 -0.727718
H  0.192227 0.307311 2.860122
H  2.214526 1.805241 -1.364278
H  2.115324 1.803105 2.920169
H  -1.349686 -3.390159 -1.61231
H  2.763433 -3.01181 -1.800263
elementType: Cl O N C H
totalener: -1777.71632730 hartree
nucrepener: 2085.22494990 hartree
electener: -3862.94127720 hartree
oneelecener: -6584.70823490 hartree
twoeener: 2721.76695770 hartree
cpcmener: -0.02868566 hartree
kineticenergy: 1772.82108321 hartree
xcener: -124.643831932866 hartree
chargesum: -0.0000000
charge: -0.076000 -0.085492 -0.382998 -0.393108 0.094736 -0.344374 -0.407011 0.621617 0.178368 -0.047583 -0.058153 -0.072250 -0.129442 -0.278020 -0.100940 -0.195204 -0.088760 -0.166634 0.061266 0.088596 0.057447 0.096657 0.095914 0.125883 0.128097 0.129816 0.059533 0.067240 0.088989 0.082622 0.097161 0.148510 0.120454 0.148085 0.173800 0.161175
qa: -0.0760 -0.0855 -0.3830 -0.3931 0.0947 -0.3444 -0.4070 0.6216 0.1784 -0.0476 -0.0582 -0.0723 -0.1294 -0.2780 -0.1009 -0.1952 -0.0888 -0.1666 0.0613 0.0886 0.0574 0.0967 0.0959 0.1259 0.1281 0.1298 0.0595 0.0672 0.0890 0.0826 0.0972 0.1485 0.1205 0.1481 0.1738 0.1612
va: 1.2358 1.2185 2.0032 1.9764 3.3698 2.8677 3.0198 3.7692 3.8521 3.9446 3.8334 3.4956 3.9445 3.9603 3.9651 3.9947 4.0291 4.0128 4.0733 3.8807 4.0533 1.0019 0.9948 0.9924 1.0170 1.0127 1.0045 1.0155 1.0016 1.0030 1.0020 1.0228 1.0253 1.0048 0.9981 0.9965
dispcorr: -0.021835975 hartree
energy: -1777.738163278608
dipole: -27.59542 25.42803 -2.16740 1.54423 -0.67356 0.87067 6.73119 -5.08124 1.64995
magnitude: 2.85972 au
magnitude: 7.26883 debye
