program: Orca
programVersion: 4.2.1
elementType: Cl Cl O O N N N C C C C C C C C C C C C C C H H H H H H H H H H H H H H H
charge: 0
multiplicity: 1
keywords: wb97x-d3
keywords: def2-TZVPP
keywords: def2/J RIJCOSX GRIDX6 NOFINALGRIDX
keywords: grid4 nofinalgrid
keywords: scfconv7
keywords: smallprint printgap noloewdin
keywords: NOSOSCF
formula: C14H15Cl2N3O2
InChI: InChI=1S/C14H15Cl2N3O2/c1-2-11-6-20-14(21-11,7-19-9-17-8-18-19)12-4-3-10(15)5-13(12)16/h3-5,8-9,11H,2,6-7H2,1H3
36 atoms
Cl 0.607146 0.068044 2.939761
Cl 3.731665 2.689368 -0.483778
O  -2.098075 -0.449665 -0.628019
O  -2.001854 -0.210568 1.606423
N  0.004144 -2.504984 -0.390109
N  1.331167 -2.512386 -0.231241
N  0.793645 -2.959563 -2.363467
C  -1.256336 -0.587792 0.486069
C  -3.363266 0.071419 -0.210668
C  -3.029996 0.65231 1.150274
C  -0.877402 -2.066863 0.66141
C  -0.013947 0.275188 0.282006
C  -3.930869 1.030907 -1.238693
C  -3.075639 2.244465 -1.569689
C  0.86487 0.600868 1.312346
C  0.326055 0.700856 -0.998862
C  2.01098 1.349456 1.089049
C  1.469538 1.437294 -1.254582
C  -0.297118 -2.760418 -1.664549
C  2.30135 1.76228 -0.19868
C  1.754517 -2.791956 -1.435076
H  -4.065409 -0.761629 -0.088317
H  -2.678275 1.688008 1.095843
H  -3.863408 0.604763 1.849202
H  -1.782538 -2.674204 0.651072
H  -0.373239 -2.232725 1.610548
H  -4.142109 0.470788 -2.152478
H  -4.903914 1.35548 -0.860342
H  -2.904326 2.883998 -0.703654
H  -2.103683 1.964008 -1.973871
H  -3.574121 2.854677 -2.323038
H  -0.314162 0.450159 -1.831729
H  2.668633 1.59759 1.910208
H  1.69983 1.749385 -2.263372
H  -1.308946 -2.81081 -2.032621
H  2.806544 -2.887039 -1.653261
elementType: Cl O N C H
totalener: -1777.71593817 hartree
nucrepener: 2073.00889430 hartree
electener: -3850.72483247 hartree
oneelecener: -6560.09769227 hartree
twoeener: 2709.37285980 hartree
cpcmener: -0.02732977 hartree
kineticenergy: 1772.82596509 hartree
xcener: -124.643932842043 hartree
chargesum: 0.0000000
charge: -0.075453 -0.085769 -0.403831 -0.374194 0.111595 -0.340203 -0.408917 0.559068 0.121521 0.013132 -0.108110 -0.038062 -0.108088 -0.286589 -0.005040 -0.205052 -0.143412 -0.186192 0.059911 0.116869 0.059952 0.083272 0.085821 0.117157 0.132553 0.128346 0.076008 0.071987 0.081093 0.087160 0.103523 0.162192 0.121002 0.147028 0.168869 0.160854
qa: -0.0755 -0.0858 -0.4038 -0.3742 0.1116 -0.3402 -0.4089 0.5591 0.1215 0.0131 -0.1081 -0.0381 -0.1081 -0.2866 -0.0050 -0.2051 -0.1434 -0.1862 0.0599 0.1169 0.0600 0.0833 0.0858 0.1172 0.1326 0.1283 0.0760 0.0720 0.0811 0.0872 0.1035 0.1622 0.1210 0.1470 0.1689 0.1609
va: 1.2446 1.2180 1.9736 1.9975 3.3595 2.8840 3.0318 3.8837 3.9733 3.9593 3.8774 3.4765 3.8971 3.9450 3.9786 3.8923 4.0913 4.0819 4.0714 3.8546 4.0446 1.0041 1.0018 0.9950 1.0109 1.0262 1.0071 1.0110 1.0035 1.0022 1.0040 1.0101 1.0253 1.0056 1.0078 0.9967
dispcorr: -0.021943024 hartree
energy: -1777.737881198289
dipole: -29.43818 26.69892 -2.73926 0.13776 0.53538 0.67314 -11.83465 11.90114 0.06649
magnitude: 2.82154 au
magnitude: 7.17178 debye
