program: Orca
programVersion: 4.2.1
elementType: Cl Cl O O N N N C C C C C C C C C C C C C C H H H H H H H H H H H H H H H
charge: 0
multiplicity: 1
keywords: wb97x-d3
keywords: def2-TZVPP
keywords: def2/J RIJCOSX GRIDX6 NOFINALGRIDX
keywords: grid4 nofinalgrid
keywords: scfconv7
keywords: smallprint printgap noloewdin
keywords: NOSOSCF
formula: C14H15Cl2N3O2
InChI: InChI=1S/C14H15Cl2N3O2/c1-2-11-6-20-14(21-11,7-19-9-17-8-18-19)12-4-3-10(15)5-13(12)16/h3-5,8-9,11H,2,6-7H2,1H3
36 atoms
Cl 0.654973 0.814319 -2.329641
Cl 2.858706 4.470459 0.851895
O  -1.299793 -0.560346 -0.634421
O  -0.833706 -0.97415 1.527018
N  -0.025074 -3.052525 -0.307091
N  -0.184948 -3.928097 0.689408
N  -1.394987 -4.542895 -1.098654
C  -0.257479 -0.67731 0.287704
C  -2.566756 -0.733981 -0.004549
C  -2.197468 -1.318204 1.354582
C  0.688627 -1.815145 -0.137181
C  0.540915 0.61597 0.399749
C  -3.36567 0.5580 0.04136
C  -2.708465 1.717866 0.772426
C  0.970671 1.340589 -0.710225
C  0.880898 1.113093 1.654153
C  1.679125 2.5263 -0.581316
C  1.594672 2.288558 1.812086
C  -0.760091 -3.426289 -1.355086
C  1.980587 2.991893 0.685364
C  -1.006004 -4.798533 0.164495
H  -3.127659 -1.466559 -0.590565
H  -2.775853 -0.889117 2.174266
H  -2.330714 -2.40321 1.381355
H  1.460189 -1.960648 0.616209
H  1.188074 -1.574672 -1.073806
H  -3.600429 0.857655 -0.983037
H  -4.324431 0.317665 0.509434
H  -3.38366 2.573331 0.7995
H  -2.458576 1.475436 1.806495
H  -1.79582 2.045007 0.274896
H  0.57896 0.579177 2.542919
H  1.988076 3.073873 -1.46059
H  1.836677 2.646457 2.802733
H  -0.785269 -2.875553 -2.281194
H  -1.335783 -5.664429 0.716133
elementType: Cl O N C H
totalener: -1777.71558809 hartree
nucrepener: 2054.57934938 hartree
electener: -3832.29493747 hartree
oneelecener: -6522.60823996 hartree
twoeener: 2690.31330249 hartree
cpcmener: -0.02492076 hartree
kineticenergy: 1772.83890127 hartree
xcener: -124.647974484465 hartree
chargesum: 0.0000000
charge: -0.074267 -0.084853 -0.393792 -0.397457 0.133452 -0.365333 -0.409395 0.589814 0.190157 -0.018648 -0.134400 -0.118373 -0.143871 -0.276765 0.006562 -0.140745 -0.150805 -0.173535 0.057061 0.116855 0.060107 0.095437 0.098681 0.095184 0.128142 0.147724 0.069019 0.074576 0.106045 0.084104 0.083038 0.147235 0.121950 0.148064 0.167026 0.162006
qa: -0.0743 -0.0849 -0.3938 -0.3975 0.1335 -0.3653 -0.4094 0.5898 0.1902 -0.0186 -0.1344 -0.1184 -0.1439 -0.2768 0.0066 -0.1407 -0.1508 -0.1735 0.0571 0.1169 0.0601 0.0954 0.0987 0.0952 0.1281 0.1477 0.0690 0.0746 0.1060 0.0841 0.0830 0.1472 0.1220 0.1481 0.1670 0.1620
va: 1.2442 1.2190 1.9924 1.9766 3.3533 2.8685 3.0234 3.8247 3.8137 3.9692 3.8264 3.4977 3.9508 3.9428 3.9553 3.9284 4.0918 4.0369 4.0690 3.8516 4.0429 0.9987 1.0003 0.9978 1.0239 1.0130 1.0104 1.0092 1.0046 1.0053 0.9971 1.0274 1.0263 1.0053 1.0052 0.9962
dispcorr: -0.022237727 hartree
energy: -1777.737825812498
dipole: -22.26718 21.81485 -0.45233 -10.33743 11.28347 0.94604 8.36906 -7.94185 0.42721
magnitude: 1.13230 au
magnitude: 2.87809 debye
