program: Orca
programVersion: 4.2.1
elementType: Cl Cl O O N N N C C C C C C C C C C C C C C H H H H H H H H H H H H H H H
charge: 0
multiplicity: 1
keywords: wb97x-d3
keywords: def2-TZVPP
keywords: def2/J RIJCOSX GRIDX6 NOFINALGRIDX
keywords: grid4 nofinalgrid
keywords: scfconv7
keywords: smallprint printgap noloewdin
keywords: NOSOSCF
formula: C14H15Cl2N3O2
InChI: InChI=1S/C14H15Cl2N3O2/c1-2-11-6-20-14(21-11,7-19-9-17-8-18-19)12-4-3-10(15)5-13(12)16/h3-5,8-9,11H,2,6-7H2,1H3
36 atoms
Cl 1.836006 -0.229477 2.191551
Cl 2.959732 4.502407 0.023994
O  -1.343859 -0.45211 -1.013395
O  -0.837022 -0.935241 1.109614
N  -0.171322 -2.962963 -0.808119
N  -0.628735 -3.306275 -2.015616
N  -1.402078 -4.718673 -0.453182
C  -0.273926 -0.608275 -0.124708
C  -2.564545 -0.321749 -0.281627
C  -2.083547 -0.268461 1.163626
C  0.603717 -1.768637 -0.603043
C  0.549514 0.677933 -0.050684
C  -3.348319 0.898282 -0.718796
C  -4.662644 1.014136 0.040493
C  1.501846 0.919355 0.938865
C  0.383996 1.658917 -1.024014
C  2.244074 2.090593 0.970973
C  1.111791 2.836535 -1.017924
C  -0.65072 -3.804119 0.109139
C  2.037988 3.042322 -0.011721
C  -1.351923 -4.36143 -1.750326
H  -3.160559 -1.225684 -0.453274
H  -1.963212 0.765604 1.511696
H  -2.731919 -0.796275 1.860113
H  1.391386 -1.973464 0.119876
H  1.082879 -1.510505 -1.544912
H  -2.74332 1.795238 -0.557975
H  -3.549274 0.835631 -1.790416
H  -5.289908 0.134122 -0.110531
H  -4.506455 1.128788 1.114766
H  -5.228057 1.882167 -0.29678
H  -0.33495 1.506444 -1.815522
H  2.971587 2.253172 1.753713
H  0.952049 3.576852 -1.788896
H  -0.414268 -3.732801 1.158171
H  -1.861743 -4.903731 -2.53098
elementType: Cl O N C H
totalener: -1777.71899300 hartree
nucrepener: 2016.78631191 hartree
electener: -3794.50530491 hartree
oneelecener: -6446.92429479 hartree
twoeener: 2652.41898988 hartree
cpcmener: -0.02683913 hartree
kineticenergy: 1772.82889872 hartree
xcener: -124.642896052292 hartree
chargesum: 0.0000000
charge: -0.075503 -0.083114 -0.398167 -0.371732 0.127203 -0.355948 -0.418304 0.577693 0.129044 -0.000003 -0.108495 -0.102029 -0.121459 -0.274368 -0.012621 -0.161443 -0.153110 -0.184526 0.067297 0.117409 0.055786 0.087134 0.093632 0.125404 0.149316 0.129980 0.062911 0.074878 0.087773 0.084133 0.097001 0.157536 0.122398 0.147374 0.164332 0.162589
qa: -0.0755 -0.0831 -0.3982 -0.3717 0.1272 -0.3559 -0.4183 0.5777 0.1290 -0.0000 -0.1085 -0.1020 -0.1215 -0.2744 -0.0126 -0.1614 -0.1531 -0.1845 0.0673 0.1174 0.0558 0.0871 0.0936 0.1254 0.1493 0.1300 0.0629 0.0749 0.0878 0.0841 0.0970 0.1575 0.1224 0.1474 0.1643 0.1626
va: 1.2452 1.2212 1.9940 1.9879 3.3758 2.8875 3.0278 3.8785 3.9122 3.8968 3.7904 3.5305 3.9475 3.9527 4.0090 3.9539 4.0875 4.0575 4.0735 3.8587 4.0553 1.0021 1.0009 0.9915 1.0158 1.0210 1.0076 1.0099 1.0016 1.0009 1.0028 1.0198 1.0258 1.0065 1.0079 0.9949
dispcorr: -0.020120095 hartree
energy: -1777.739113098459
dipole: -30.31825 29.87059 -0.44766 -6.03657 7.64534 1.60878 -6.23813 6.69113 0.45300
magnitude: 1.73025 au
magnitude: 4.39795 debye
