program: Orca
programVersion: 4.2.1
elementType: Cl Cl O O N N N C C C C C C C C C C C C C C H H H H H H H H H H H H H H H
charge: 0
multiplicity: 1
keywords: wb97x-d3
keywords: def2-TZVPP
keywords: def2/J RIJCOSX GRIDX6 NOFINALGRIDX
keywords: grid4 nofinalgrid
keywords: scfconv7
keywords: smallprint printgap noloewdin
keywords: NOSOSCF
formula: C14H15Cl2N3O2
InChI: InChI=1S/C14H15Cl2N3O2/c1-2-11-6-20-14(21-11,7-19-9-17-8-18-19)12-4-3-10(15)5-13(12)16/h3-5,8-9,11H,2,6-7H2,1H3
36 atoms
Cl -0.232205 0.808072 -2.562358
Cl 3.829284 2.414794 0.485378
O  -2.392192 0.051051 -0.662361
O  -1.830953 -0.924482 1.283172
N  0.113173 -2.568717 -0.429222
N  0.304611 -3.13742 0.763639
N  2.246373 -2.98237 -0.353443
C  -1.36764 -0.639833 -0.009113
C  -3.270093 0.598206 0.316568
C  -3.157397 -0.435805 1.425438
C  -1.131608 -1.946453 -0.792549
C  -0.076814 0.171506 0.09517
C  -2.880498 2.011581 0.725198
C  -3.974422 2.682543 1.542508
C  0.493858 0.834277 -0.98921
C  0.61835 0.213946 1.300753
C  1.68862 1.529899 -0.87924
C  1.814958 0.895226 1.438728
C  1.279506 -2.467672 -1.070139
C  2.338678 1.553911 0.341314
C  1.591396 -3.369446 0.757132
H  -4.270809 0.606155 -0.121528
H  -3.274642 -0.019979 2.426795
H  -3.881903 -1.245381 1.299701
H  -1.096345 -1.745062 -1.86115
H  -1.956413 -2.635526 -0.613519
H  -1.945984 2.001892 1.293599
H  -2.691669 2.594518 -0.179245
H  -4.186435 2.143328 2.467471
H  -3.684899 3.695936 1.819064
H  -4.906633 2.74853 0.978709
H  0.218428 -0.295844 2.164114
H  2.104183 2.039759 -1.73709
H  2.325395 0.907313 2.391336
H  1.371162 -2.040125 -2.056536
H  2.081165 -3.848768 1.590045
elementType: Cl O N C H
totalener: -1777.71550515 hartree
nucrepener: 2078.14914175 hartree
electener: -3855.86464690 hartree
oneelecener: -6570.32767527 hartree
twoeener: 2714.46302837 hartree
cpcmener: -0.02828280 hartree
kineticenergy: 1772.82768032 hartree
xcener: -124.644023208142 hartree
chargesum: 0.0000000
charge: -0.070874 -0.084004 -0.379928 -0.397624 0.132548 -0.349644 -0.400639 0.587951 0.176008 0.017569 -0.159745 -0.104435 -0.148222 -0.268539 -0.023648 -0.171844 -0.121463 -0.160021 0.068377 0.106174 0.055767 0.102139 0.096473 0.089984 0.139001 0.126197 0.075622 0.067657 0.078915 0.095005 0.084707 0.143952 0.120701 0.148803 0.166595 0.160484
qa: -0.0709 -0.0840 -0.3799 -0.3976 0.1325 -0.3496 -0.4006 0.5880 0.1760 0.0176 -0.1597 -0.1044 -0.1482 -0.2685 -0.0236 -0.1718 -0.1215 -0.1600 0.0684 0.1062 0.0558 0.1021 0.0965 0.0900 0.1390 0.1262 0.0756 0.0677 0.0789 0.0950 0.0847 0.1440 0.1207 0.1488 0.1666 0.1605
va: 1.2484 1.2203 2.0153 1.9662 3.3376 2.8874 3.0281 3.7962 3.9254 3.9679 3.9328 3.4947 3.9173 3.9551 3.9666 3.8961 4.0749 4.0462 4.0587 3.8630 4.0589 0.9969 0.9943 0.9995 1.0081 1.0151 1.0016 1.0194 1.0053 1.0020 1.0017 1.0349 1.0249 1.0032 1.0001 0.9967
dispcorr: -0.022041982 hartree
energy: -1777.737547130653
dipole: -27.22896 25.08958 -2.13939 0.10773 0.76149 0.86921 12.17263 -12.02168 0.15095
magnitude: 2.31415 au
magnitude: 5.88210 debye
