program: Orca
programVersion: 4.2.1
elementType: Cl Cl O O N N N C C C C C C C C C C C C C C H H H H H H H H H H H H H H H
charge: 0
multiplicity: 1
keywords: wb97x-d3
keywords: def2-TZVPP
keywords: def2/J RIJCOSX GRIDX6 NOFINALGRIDX
keywords: grid4 nofinalgrid
keywords: scfconv7
keywords: smallprint printgap noloewdin
keywords: NOSOSCF
formula: C14H15Cl2N3O2
InChI: InChI=1S/C14H15Cl2N3O2/c1-2-11-6-20-14(21-11,7-19-9-17-8-18-19)12-4-3-10(15)5-13(12)16/h3-5,8-9,11H,2,6-7H2,1H3
36 atoms
Cl -0.179595 1.136736 -2.542078
Cl 3.844082 2.599821 0.622713
O  -2.280788 0.124059 -0.736782
O  -1.69324 -0.987282 1.131526
N  0.11786 -2.620133 -0.477776
N  -0.076319 -3.531329 0.47982
N  2.112797 -3.322982 0.026565
C  -1.238743 -0.587192 -0.130536
C  -3.245779 0.462299 0.257705
C  -3.077914 -0.689697 1.23268
C  -0.956562 -1.821386 -1.006926
C  0.020117 0.257029 0.044037
C  -2.995835 1.838958 0.854638
C  -4.14724 2.289358 1.741163
C  0.558273 1.036807 -0.978276
C  0.720791 0.217335 1.246712
C  1.727755 1.763551 -0.808301
C  1.892977 0.926757 1.441976
C  1.423589 -2.501447 -0.724751
C  2.38498 1.701034 0.406908
C  1.142472 -3.923808 0.740708
H  -4.226052 0.44078 -0.223948
H  -3.303268 -0.43282 2.267729
H  -3.686903 -1.553365 0.948481
H  -0.691216 -1.522354 -2.019582
H  -1.852148 -2.438196 -1.070532
H  -2.063129 1.841119 1.426375
H  -2.864072 2.551078 0.03681
H  -4.294221 1.622858 2.592599
H  -3.961829 3.286068 2.140556
H  -5.085765 2.326271 1.18524
H  0.347468 -0.381627 2.064149
H  2.116725 2.366268 -1.617073
H  2.409087 0.870606 2.389857
H  1.823239 -1.828312 -1.467427
H  1.341499 -4.686897 1.476609
elementType: Cl O N C H
totalener: -1777.71628552 hartree
nucrepener: 2057.82403946 hartree
electener: -3835.54032498 hartree
oneelecener: -6529.41388781 hartree
twoeener: 2693.87356283 hartree
cpcmener: -0.02782645 hartree
kineticenergy: 1772.82319429 hartree
xcener: -124.642340533303 hartree
chargesum: -0.0000000
charge: -0.072197 -0.082921 -0.387072 -0.390551 0.134231 -0.351707 -0.407263 0.556870 0.178592 0.008533 -0.146235 -0.146307 -0.147090 -0.271941 0.020768 -0.131330 -0.137845 -0.173162 0.050133 0.117786 0.062371 0.103925 0.101218 0.091355 0.146654 0.120817 0.074114 0.068435 0.080501 0.094912 0.085578 0.146164 0.121115 0.149015 0.169708 0.162829
qa: -0.0722 -0.0829 -0.3871 -0.3906 0.1342 -0.3517 -0.4073 0.5569 0.1786 0.0085 -0.1462 -0.1463 -0.1471 -0.2719 0.0208 -0.1313 -0.1378 -0.1732 0.0501 0.1178 0.0624 0.1039 0.1012 0.0914 0.1467 0.1208 0.0741 0.0684 0.0805 0.0949 0.0856 0.1462 0.1211 0.1490 0.1697 0.1628
va: 1.2478 1.2211 2.0090 1.9696 3.3325 2.8972 3.0262 3.9012 3.9103 3.9736 3.9054 3.4957 3.9210 3.9536 3.9422 3.8637 4.0945 4.0598 4.0817 3.8550 4.0497 0.9967 0.9945 1.0000 1.0107 1.0213 1.0034 1.0187 1.0046 1.0021 1.0012 1.0292 1.0260 1.0037 0.9937 0.9953
dispcorr: -0.021337313 hartree
energy: -1777.737622831740
dipole: -27.56942 25.67989 -1.88953 -2.77366 3.75604 0.98238 12.05997 -11.96162 0.09835
magnitude: 2.13191 au
magnitude: 5.41890 debye
