program: Orca
programVersion: 4.2.1
elementType: Cl Cl O O N N N C C C C C C C C C C C C C C H H H H H H H H H H H H H H H
charge: 0
multiplicity: 1
keywords: wb97x-d3
keywords: def2-TZVPP
keywords: def2/J RIJCOSX GRIDX6 NOFINALGRIDX
keywords: grid4 nofinalgrid
keywords: scfconv7
keywords: smallprint printgap noloewdin
keywords: NOSOSCF
formula: C14H15Cl2N3O2
InChI: InChI=1S/C14H15Cl2N3O2/c1-2-11-6-20-14(21-11,7-19-9-17-8-18-19)12-4-3-10(15)5-13(12)16/h3-5,8-9,11H,2,6-7H2,1H3
36 atoms
Cl 0.429442 -0.867081 2.828703
Cl 3.751865 2.497011 0.376396
O  -2.24331 -0.145212 -0.737355
O  -2.18868 -0.506415 1.461497
N  -0.095209 -2.328301 -0.885474
N  -0.264119 -2.103886 -2.19119
N  1.899511 -2.493839 -1.733491
C  -1.430371 -0.625881 0.295131
C  -3.2161 0.751723 -0.189288
C  -2.937574 0.68551 1.312438
C  -1.146902 -2.119233 0.072826
C  -0.12984 0.179068 0.362476
C  -3.108599 2.147972 -0.767944
C  -3.31438 2.199177 -2.273017
C  0.747453 0.124893 1.443927
C  0.256432 0.954538 -0.726819
C  1.938614 0.83464 1.46027
C  1.440368 1.671217 -0.741267
C  1.197406 -2.539968 -0.629907
C  2.27108 1.608073 0.362462
C  0.953804 -2.221053 -2.652315
H  -4.203711 0.339159 -0.419252
H  -2.364956 1.555736 1.655129
H  -3.842202 0.609879 1.913049
H  -2.054667 -2.620012 -0.261022
H  -0.837068 -2.58361 1.006752
H  -3.8683 2.759066 -0.272143
H  -2.142385 2.585334 -0.500979
H  -3.27773 3.226807 -2.633987
H  -2.54589 1.638859 -2.80653
H  -4.283611 1.785167 -2.556734
H  -0.384031 1.005259 -1.594993
H  2.596858 0.776797 2.315766
H  1.703852 2.266321 -1.604147
H  1.574075 -2.745622 0.359998
H  1.169912 -2.110748 -3.703217
elementType: Cl O N C H
totalener: -1777.71687887 hartree
nucrepener: 2082.80919584 hartree
electener: -3860.52607471 hartree
oneelecener: -6579.48576961 hartree
twoeener: 2718.95969490 hartree
cpcmener: -0.02818592 hartree
kineticenergy: 1772.82891197 hartree
xcener: -124.643611833934 hartree
chargesum: -0.0000000
charge: -0.069033 -0.082721 -0.394389 -0.366907 0.129550 -0.349193 -0.400664 0.613128 0.138694 0.001754 -0.143187 -0.089335 -0.157609 -0.267040 -0.054692 -0.211145 -0.116376 -0.167389 0.070613 0.106094 0.056078 0.092944 0.086068 0.118534 0.128071 0.142730 0.091103 0.068604 0.094735 0.079260 0.084269 0.171292 0.120590 0.147420 0.166509 0.161642
qa: -0.0690 -0.0827 -0.3944 -0.3669 0.1295 -0.3492 -0.4007 0.6131 0.1387 0.0018 -0.1432 -0.0893 -0.1576 -0.2670 -0.0547 -0.2111 -0.1164 -0.1674 0.0706 0.1061 0.0561 0.0929 0.0861 0.1185 0.1281 0.1427 0.0911 0.0686 0.0947 0.0793 0.0843 0.1713 0.1206 0.1474 0.1665 0.1616
va: 1.2516 1.2214 1.9796 2.0093 3.3446 2.8931 3.0297 3.8033 3.8925 3.9512 3.8803 3.4860 3.9217 3.9310 4.0106 3.8911 4.0547 4.0718 4.0575 3.8656 4.0588 1.0015 1.0030 0.9946 1.0242 1.0077 1.0112 1.0030 1.0042 1.0088 1.0011 0.9998 1.0240 1.0046 1.0001 0.9963
dispcorr: -0.022241788 hartree
energy: -1777.739120653617
dipole: -26.95753 25.27646 -1.68107 5.63224 -4.63788 0.99437 -13.43501 14.31920 0.88419
magnitude: 2.14395 au
magnitude: 5.44949 debye
