program: Orca
programVersion: 4.2.1
elementType: Cl Cl O O N N N C C C C C C C C C C C C C C H H H H H H H H H H H H H H H
charge: 0
multiplicity: 1
keywords: wb97x-d3
keywords: def2-TZVPP
keywords: def2/J RIJCOSX GRIDX6 NOFINALGRIDX
keywords: grid4 nofinalgrid
keywords: scfconv7
keywords: smallprint printgap noloewdin
keywords: NOSOSCF
formula: C14H15Cl2N3O2
InChI: InChI=1S/C14H15Cl2N3O2/c1-2-11-6-20-14(21-11,7-19-9-17-8-18-19)12-4-3-10(15)5-13(12)16/h3-5,8-9,11H,2,6-7H2,1H3
36 atoms
Cl -0.461279 1.204406 -2.380624
Cl 3.718392 2.672511 0.57178
O  -2.399639 0.014998 -0.484914
O  -1.633609 -1.163392 1.274835
N  0.133899 -2.615086 -0.538859
N  0.050468 -3.58731 0.37342
N  2.191713 -3.232395 -0.202525
C  -1.287843 -0.673906 0.008768
C  -3.277465 0.298945 0.604174
C  -3.004442 -0.881951 1.517737
C  -1.012776 -1.847021 -0.949573
C  -0.054825 0.216846 0.14191
C  -3.003889 1.651281 1.241607
C  -3.091754 2.806488 0.258228
C  0.385183 1.061496 -0.875598
C  0.727784 0.150578 1.291755
C  1.537481 1.823982 -0.750738
C  1.885144 0.894495 1.441753
C  1.412685 -2.41103 -0.860459
C  2.278781 1.731419 0.413133
C  1.302553 -3.925101 0.533956
H  -4.294593 0.276045 0.207147
H  -3.135469 -0.654206 2.575918
H  -3.629446 -1.744036 1.265582
H  -0.836411 -1.485375 -1.961388
H  -1.880789 -2.504832 -0.980995
H  -3.743789 1.786531 2.03527
H  -2.026906 1.649743 1.734306
H  -2.346218 2.721823 -0.532868
H  -4.075191 2.851935 -0.21463
H  -2.927263 3.758274 0.764212
H  0.432419 -0.500172 2.101562
H  1.850243 2.474538 -1.555483
H  2.467396 0.814374 2.348716
H  1.727348 -1.677959 -1.587118
H  1.588758 -4.714274 1.211351
elementType: Cl O N C H
totalener: -1777.71630315 hartree
nucrepener: 2077.30858587 hartree
electener: -3855.02488902 hartree
oneelecener: -6568.39629683 hartree
twoeener: 2713.37140781 hartree
cpcmener: -0.02762393 hartree
kineticenergy: 1772.82147528 hartree
xcener: -124.642613971880 hartree
chargesum: 0.0000000
charge: -0.075726 -0.082768 -0.382034 -0.391371 0.135591 -0.352452 -0.406676 0.552269 0.184014 0.006025 -0.138773 -0.113262 -0.160457 -0.278405 -0.027224 -0.136878 -0.116062 -0.166914 0.048471 0.108968 0.062351 0.109338 0.096836 0.092805 0.147085 0.119754 0.082638 0.076532 0.076573 0.085677 0.095417 0.146262 0.121124 0.149061 0.169838 0.162375
qa: -0.0757 -0.0828 -0.3820 -0.3914 0.1356 -0.3525 -0.4067 0.5523 0.1840 0.0060 -0.1388 -0.1133 -0.1605 -0.2784 -0.0272 -0.1369 -0.1161 -0.1669 0.0485 0.1090 0.0624 0.1093 0.0968 0.0928 0.1471 0.1198 0.0826 0.0765 0.0766 0.0857 0.0954 0.1463 0.1211 0.1491 0.1698 0.1624
va: 1.2407 1.2214 2.0032 1.9721 3.3326 2.8980 3.0260 3.9200 3.8752 4.0019 3.8889 3.4848 3.9101 3.9448 3.9437 3.8676 4.0780 4.0501 4.0832 3.8639 4.0506 0.9933 0.9920 0.9973 1.0106 1.0232 1.0110 1.0005 1.0144 1.0017 1.0056 1.0301 1.0249 1.0034 0.9938 0.9955
dispcorr: -0.022258166 hartree
energy: -1777.738561318924
dipole: -23.98598 22.08003 -1.90595 -2.43559 3.35509 0.91950 9.42328 -9.11671 0.30656
magnitude: 2.13825 au
magnitude: 5.43500 debye
