program: Orca
programVersion: 4.2.1
elementType: Cl Cl O O N N N C C C C C C C C C C C C C C H H H H H H H H H H H H H H H
charge: 0
multiplicity: 1
keywords: wb97x-d3
keywords: def2-TZVPP
keywords: def2/J RIJCOSX GRIDX6 NOFINALGRIDX
keywords: grid4 nofinalgrid
keywords: scfconv7
keywords: smallprint printgap noloewdin
keywords: NOSOSCF
formula: C14H15Cl2N3O2
InChI: InChI=1S/C14H15Cl2N3O2/c1-2-11-6-20-14(21-11,7-19-9-17-8-18-19)12-4-3-10(15)5-13(12)16/h3-5,8-9,11H,2,6-7H2,1H3
36 atoms
Cl 2.040667 -0.167023 1.955782
Cl 2.715504 4.603391 -0.307147
O  -1.529044 -0.472677 -0.78806
O  -0.65675 -1.03072 1.201662
N  -0.168019 -2.962471 -0.823819
N  -0.051853 -3.8803 0.139256
N  -1.583113 -4.518081 -1.371639
C  -0.321412 -0.621347 -0.087833
C  -2.630865 -0.684697 0.099772
C  -1.966449 -0.558467 1.458373
C  0.523012 -1.703237 -0.772738
C  0.451488 0.695813 -0.103249
C  -3.772251 0.268837 -0.197711
C  -3.478786 1.750831 -0.015064
C  1.503529 0.973101 0.768467
C  0.151489 1.659004 -1.062841
C  2.199105 2.17247 0.716626
C  0.834177 2.860343 -1.143059
C  -1.089339 -3.351539 -1.70633
C  1.851777 3.109227 -0.239716
C  -0.911123 -4.789699 -0.237014
H  -2.994673 -1.710387 -0.036882
H  -1.947464 0.473223 1.825304
H  -2.425102 -1.188599 2.218335
H  1.468999 -1.850014 -0.257126
H  0.749166 -1.387282 -1.789907
H  -4.110338 0.083681 -1.220323
H  -4.605582 -0.024959 0.44562
H  -4.33516 2.342376 -0.338602
H  -3.286599 2.012273 1.025797
H  -2.62047 2.07561 -0.602847
H  -0.638375 1.471129 -1.775223
H  3.003552 2.365319 1.412398
H  0.571332 3.585246 -1.90054
H  -1.349512 -2.774229 -2.578502
H  -1.057758 -5.694913 0.330863
elementType: Cl O N C H
totalener: -1777.71725556 hartree
nucrepener: 2030.28300853 hartree
electener: -3808.00026409 hartree
oneelecener: -6474.13020386 hartree
twoeener: 2666.12993977 hartree
cpcmener: -0.02860725 hartree
kineticenergy: 1772.82990294 hartree
xcener: -124.644396225247 hartree
chargesum: 0.0000000
charge: -0.074694 -0.084161 -0.416928 -0.360950 0.130716 -0.355184 -0.417061 0.573969 0.112095 0.013659 -0.107704 -0.047065 -0.105801 -0.289604 -0.014286 -0.216953 -0.150209 -0.164873 0.048142 0.110056 0.058827 0.083896 0.090245 0.118403 0.131981 0.142505 0.076017 0.072503 0.102525 0.080112 0.092735 0.160722 0.122550 0.147953 0.173775 0.162086
qa: -0.0747 -0.0842 -0.4169 -0.3609 0.1307 -0.3552 -0.4171 0.5740 0.1121 0.0137 -0.1077 -0.0471 -0.1058 -0.2896 -0.0143 -0.2170 -0.1502 -0.1649 0.0481 0.1101 0.0588 0.0839 0.0902 0.1184 0.1320 0.1425 0.0760 0.0725 0.1025 0.0801 0.0927 0.1607 0.1226 0.1480 0.1738 0.1621
va: 1.2440 1.2205 1.9730 1.9954 3.3750 2.8925 3.0197 3.8798 3.9636 3.9296 3.8090 3.5302 3.9074 3.9474 3.9949 3.9785 4.0819 4.0380 4.0621 3.8656 4.0500 1.0018 1.0036 0.9968 1.0299 1.0035 1.0075 1.0102 1.0047 1.0024 0.9999 1.0160 1.0258 1.0060 1.0020 0.9953
dispcorr: -0.020835249 hartree
energy: -1777.738090806136
dipole: -28.70966 27.77697 -0.93268 -6.08209 7.72839 1.64630 -5.35338 4.70888 -0.64450
magnitude: 1.99890 au
magnitude: 5.08079 debye
