program: Orca
programVersion: 4.2.1
elementType: Cl Cl O O N N N C C C C C C C C C C C C C C H H H H H H H H H H H H H H H
charge: 0
multiplicity: 1
keywords: wb97x-d3
keywords: def2-TZVPP
keywords: def2/J RIJCOSX GRIDX6 NOFINALGRIDX
keywords: grid4 nofinalgrid
keywords: scfconv7
keywords: smallprint printgap noloewdin
keywords: NOSOSCF
formula: C14H15Cl2N3O2
InChI: InChI=1S/C14H15Cl2N3O2/c1-2-11-6-20-14(21-11,7-19-9-17-8-18-19)12-4-3-10(15)5-13(12)16/h3-5,8-9,11H,2,6-7H2,1H3
36 atoms
Cl 0.375399 0.991704 -2.450772
Cl 3.002256 4.375818 0.711765
O  -1.409999 -0.496034 -0.648705
O  -0.707552 -1.059511 1.41428
N  -0.020149 -3.061229 -0.421551
N  -0.897587 -3.443455 -1.353876
N  -0.780039 -4.970839 0.28768
C  -0.273246 -0.673358 0.141386
C  -2.598321 -0.700454 0.107995
C  -2.087329 -1.381222 1.372979
C  0.626432 -1.776583 -0.445319
C  0.543108 0.610049 0.254607
C  -3.367686 0.590781 0.334373
C  -2.628407 1.685119 1.087615
C  0.869545 1.402786 -0.843225
C  1.023392 1.014816 1.49632
C  1.619578 2.562664 -0.712127
C  1.779041 2.163295 1.655684
C  0.025456 -3.971719 0.552144
C  2.066198 2.933504 0.54287
C  -1.319033 -4.588891 -0.885722
H  -3.235086 -1.384544 -0.458087
H  -2.56287 -1.00927 2.281713
H  -2.23332 -2.464826 1.337427
H  1.538197 -1.849431 0.146926
H  0.915952 -1.545725 -1.468133
H  -3.694455 0.973494 -0.635704
H  -4.281018 0.32119 0.872163
H  -1.768103 2.051749 0.528828
H  -3.289637 2.535699 1.253968
H  -2.276303 1.357755 2.066922
H  0.801534 0.426092 2.373859
H  1.849768 3.162895 -1.581021
H  2.132285 2.447814 2.636454
H  0.666024 -3.875523 1.413834
H  -2.043525 -5.182524 -1.420103
elementType: Cl O N C H
totalener: -1777.71516919 hartree
nucrepener: 2049.34908505 hartree
electener: -3827.06425425 hartree
oneelecener: -6512.36861766 hartree
twoeener: 2685.30436341 hartree
cpcmener: -0.02720302 hartree
kineticenergy: 1772.82747292 hartree
xcener: -124.645425697907 hartree
chargesum: 0.0000000
charge: -0.074774 -0.085000 -0.378339 -0.407920 0.122572 -0.356362 -0.414166 0.582086 0.184685 -0.014310 -0.121436 -0.117444 -0.142857 -0.279349 0.019085 -0.146714 -0.149642 -0.172508 0.053899 0.115730 0.064665 0.087432 0.101074 0.092463 0.134659 0.134276 0.069036 0.073519 0.084142 0.106348 0.083968 0.146662 0.121153 0.147559 0.174562 0.161245
qa: -0.0748 -0.0850 -0.3783 -0.4079 0.1226 -0.3564 -0.4142 0.5821 0.1847 -0.0143 -0.1214 -0.1174 -0.1429 -0.2793 0.0191 -0.1467 -0.1496 -0.1725 0.0539 0.1157 0.0647 0.0874 0.1011 0.0925 0.1347 0.1343 0.0690 0.0735 0.0841 0.1063 0.0840 0.1467 0.1212 0.1476 0.1746 0.1612
va: 1.2440 1.2189 2.0056 1.9650 3.3942 2.8927 3.0218 3.8240 3.8573 3.9638 3.8515 3.5221 3.9422 3.9414 3.9523 3.9327 4.0973 4.0374 4.0578 3.8526 4.0348 1.0053 1.0008 0.9954 1.0048 1.0263 1.0105 1.0100 0.9967 1.0044 1.0053 1.0286 1.0267 1.0053 0.9979 0.9967
dispcorr: -0.021941212 hartree
energy: -1777.737110405583
dipole: -20.96608 20.91308 -0.05301 -11.04314 11.72706 0.68392 11.27738 -9.92239 1.35499
magnitude: 1.51874 au
magnitude: 3.86033 debye
