program: Orca
programVersion: 4.2.1
elementType: Cl Cl O O N N N C C C C C C C C C C C C C C H H H H H H H H H H H H H H H
charge: 0
multiplicity: 1
keywords: wb97x-d3
keywords: def2-TZVPP
keywords: def2/J RIJCOSX GRIDX6 NOFINALGRIDX
keywords: grid4 nofinalgrid
keywords: scfconv7
keywords: smallprint printgap noloewdin
keywords: NOSOSCF
formula: C14H15Cl2N3O2
InChI: InChI=1S/C14H15Cl2N3O2/c1-2-11-6-20-14(21-11,7-19-9-17-8-18-19)12-4-3-10(15)5-13(12)16/h3-5,8-9,11H,2,6-7H2,1H3
36 atoms
Cl 0.940567 -1.077637 1.839976
Cl 3.396478 3.218072 -0.089827
O  -2.463328 0.219152 -0.809004
O  -1.769593 -1.074402 0.856627
N  -0.001765 -2.470127 -1.030671
N  1.246881 -2.191616 -1.413597
N  1.212214 -4.02377 -0.11879
C  -1.36108 -0.514314 -0.349541
C  -3.197227 0.683534 0.32965
C  -2.558863 -0.086233 1.493947
C  -1.115188 -1.625979 -1.371546
C  -0.142431 0.402824 -0.205327
C  -3.129492 2.188015 0.498299
C  -3.699396 2.962825 -0.677648
C  0.895225 0.227928 0.70714
C  -0.028394 1.469782 -1.094937
C  1.980941 1.093886 0.751563
C  1.045336 2.340395 -1.080993
C  -0.002209 -3.553855 -0.254462
C  2.044875 2.143482 -0.144169
C  1.931542 -3.145125 -0.840161
H  -4.237621 0.380051 0.182205
H  -1.942441 0.569227 2.121055
H  -3.290649 -0.581333 2.130324
H  -0.928457 -1.192486 -2.352213
H  -2.008765 -2.246156 -1.440434
H  -3.691728 2.431587 1.404758
H  -2.096897 2.493367 0.688441
H  -3.674672 4.034725 -0.481531
H  -3.132503 2.787673 -1.592644
H  -4.737541 2.688029 -0.872012
H  -0.804841 1.634614 -1.828954
H  2.767893 0.940068 1.476561
H  1.093888 3.156102 -1.787959
H  -0.901338 -3.971338 0.168668
H  3.000911 -3.217355 -0.958716
elementType: Cl O N C H
totalener: -1777.71622540 hartree
nucrepener: 2084.71220814 hartree
electener: -3862.42843354 hartree
oneelecener: -6583.60535065 hartree
twoeener: 2721.17691711 hartree
cpcmener: -0.02878473 hartree
kineticenergy: 1772.84465177 hartree
xcener: -124.647482204875 hartree
chargesum: -0.0000000
charge: -0.073402 -0.084646 -0.406064 -0.371491 0.096519 -0.345890 -0.404621 0.623420 0.172176 -0.032129 -0.063843 -0.050678 -0.160633 -0.270079 -0.060377 -0.250221 -0.112767 -0.155336 0.059926 0.092026 0.057559 0.099589 0.089968 0.116366 0.131054 0.130186 0.090983 0.066772 0.094455 0.078821 0.084880 0.157999 0.118618 0.147615 0.173323 0.159922
qa: -0.0734 -0.0846 -0.4061 -0.3715 0.0965 -0.3459 -0.4046 0.6234 0.1722 -0.0321 -0.0638 -0.0507 -0.1606 -0.2701 -0.0604 -0.2502 -0.1128 -0.1553 0.0599 0.0920 0.0576 0.0996 0.0900 0.1164 0.1311 0.1302 0.0910 0.0668 0.0945 0.0788 0.0849 0.1580 0.1186 0.1476 0.1733 0.1599
va: 1.2440 1.2198 1.9719 1.9950 3.3706 2.8702 3.0207 3.7818 3.8595 3.9617 3.8296 3.4366 3.9245 3.9385 3.9764 4.0251 4.0401 4.0245 4.0741 3.8796 4.0551 1.0009 1.0026 0.9976 1.0111 1.0181 1.0118 1.0013 1.0043 1.0065 1.0008 1.0097 1.0263 1.0049 0.9995 0.9971
dispcorr: -0.022059775 hartree
energy: -1777.738285171142
dipole: -29.19852 26.66154 -2.53698 6.16491 -4.83202 1.33289 -5.20121 5.17612 -0.02509
magnitude: 2.86591 au
magnitude: 7.28458 debye
