program: Orca
programVersion: 4.2.1
elementType: Cl Cl O O N N N C C C C C C C C C C C C C C H H H H H H H H H H H H H H H
charge: 0
multiplicity: 1
keywords: wb97x-d3
keywords: def2-TZVPP
keywords: def2/J RIJCOSX GRIDX6 NOFINALGRIDX
keywords: grid4 nofinalgrid
keywords: scfconv7
keywords: smallprint printgap noloewdin
keywords: NOSOSCF
formula: C14H15Cl2N3O2
InChI: InChI=1S/C14H15Cl2N3O2/c1-2-11-6-20-14(21-11,7-19-9-17-8-18-19)12-4-3-10(15)5-13(12)16/h3-5,8-9,11H,2,6-7H2,1H3
36 atoms
Cl 1.951865 -0.238429 2.04588
Cl 2.878656 4.551813 -0.087487
O  -1.48723 -0.373976 -0.868252
O  -0.745517 -0.987571 1.160367
N  -0.227729 -2.917051 -0.833228
N  -0.930559 -3.22809 -1.925392
N  -1.234395 -4.772011 -0.33087
C  -0.332098 -0.574389 -0.107156
C  -2.641778 -0.691559 -0.092301
C  -2.100458 -0.610548 1.323213
C  0.515423 -1.689184 -0.737544
C  0.482063 0.716435 -0.060822
C  -3.798699 0.227123 -0.436212
C  -3.581593 1.709731 -0.174886
C  1.508052 0.94009 0.856183
C  0.243848 1.714684 -1.001509
C  2.245623 2.115353 0.857041
C  0.966348 2.895075 -1.026184
C  -0.422782 -3.842454 0.111269
C  1.96293 3.086747 -0.08607
C  -1.51469 -4.346591 -1.579875
H  -2.947034 -1.721998 -0.313305
H  -2.177293 0.394647 1.751732
H  -2.580636 -1.31389 2.002903
H  1.415222 -1.867355 -0.150347
H  0.827896 -1.399062 -1.739528
H  -4.052245 0.071969 -1.487862
H  -4.664972 -0.126453 0.129963
H  -3.467596 1.934837 0.886015
H  -2.702523 2.094586 -0.692496
H  -4.441041 2.280229 -0.529304
H  -0.527825 1.573711 -1.74433
H  3.030959 2.264531 1.584871
H  0.749232 3.648251 -1.770648
H  0.046333 -3.802825 1.082059
H  -2.163042 -4.881426 -2.256828
elementType: Cl O N C H
totalener: -1777.72595310 hartree
nucrepener: 2028.65990982 hartree
electener: -3806.38586292 hartree
oneelecener: -6470.80036698 hartree
twoeener: 2664.41450406 hartree
cpcmener: -0.02305825 hartree
kineticenergy: 1772.79674820 hartree
xcener: -124.638578865434 hartree
chargesum: 0.0000000
charge: -0.074308 -0.082222 -0.391680 -0.371964 0.122847 -0.350114 -0.406595 0.572104 0.095427 0.023195 -0.131417 -0.039316 -0.107158 -0.282669 -0.018314 -0.196401 -0.149872 -0.166415 0.061349 0.108288 0.054932 0.081967 0.093085 0.114545 0.144851 0.129745 0.076664 0.071508 0.078123 0.088758 0.100494 0.157487 0.121693 0.145179 0.166344 0.159859
qa: -0.0743 -0.0822 -0.3917 -0.3720 0.1228 -0.3501 -0.4066 0.5721 0.0954 0.0232 -0.1314 -0.0393 -0.1072 -0.2827 -0.0183 -0.1964 -0.1499 -0.1664 0.0613 0.1083 0.0549 0.0820 0.0931 0.1145 0.1449 0.1297 0.0767 0.0715 0.0781 0.0888 0.1005 0.1575 0.1217 0.1452 0.1663 0.1599
va: 1.2446 1.2221 2.0015 1.9843 3.3753 2.8812 3.0307 3.8691 3.9979 3.9136 3.8168 3.5352 3.9060 3.9507 4.0043 3.9708 4.0821 4.0411 4.0676 3.8734 4.0488 0.9983 1.0050 0.9974 1.0154 1.0219 1.0077 1.0100 1.0034 1.0012 1.0049 1.0180 1.0256 1.0071 1.0047 0.9965
dispcorr: -0.020813036 hartree
energy: -1777.746766138150
dipole: -28.73905 28.23177 -0.50728 -6.56948 7.76087 1.19138 -5.74597 6.07921 0.33324
magnitude: 1.33708 au
magnitude: 3.39858 debye
