program: Orca
programVersion: 4.2.1
elementType: Cl Cl O O N N N C C C C C C C C C C C C C C H H H H H H H H H H H H H H H
charge: 0
multiplicity: 1
keywords: wb97x-d3
keywords: def2-TZVPP
keywords: def2/J RIJCOSX GRIDX6 NOFINALGRIDX
keywords: grid4 nofinalgrid
keywords: scfconv7
keywords: smallprint printgap noloewdin
keywords: NOSOSCF
formula: C14H15Cl2N3O2
InChI: InChI=1S/C14H15Cl2N3O2/c1-2-11-6-20-14(21-11,7-19-9-17-8-18-19)12-4-3-10(15)5-13(12)16/h3-5,8-9,11H,2,6-7H2,1H3
36 atoms
Cl 2.186754 -0.41779 1.869366
Cl 2.887838 4.551725 0.087283
O  -1.531238 -0.345669 -0.697593
O  -0.633707 -1.052594 1.225073
N  -0.331239 -2.857544 -0.95751
N  -1.068462 -3.077534 -2.047762
N  -1.368548 -4.719511 -0.556004
C  -0.317125 -0.579693 -0.047324
C  -2.602362 -0.385616 0.24628
C  -1.867115 -0.457243 1.576609
C  0.454351 -1.661913 -0.809604
C  0.508871 0.706153 0.016227
C  -3.517534 0.811166 0.104345
C  -4.231793 0.875355 -1.236069
C  1.627385 0.855514 0.835492
C  0.166997 1.786132 -0.792278
C  2.36222 2.031782 0.863758
C  0.882279 2.971376 -0.785277
C  -0.525375 -3.839898 -0.073492
C  1.97788 3.083627 0.051483
C  -1.667876 -4.204184 -1.765217
H  -3.174244 -1.306085 0.0759
H  -1.717069 0.53834 2.013715
H  -2.365628 -1.086375 2.312739
H  1.38239 -1.906989 -0.295532
H  0.713955 -1.301777 -1.803743
H  -4.256707 0.751501 0.908966
H  -2.94816 1.729191 0.276878
H  -4.917384 1.722645 -1.269612
H  -3.532128 0.98875 -2.064957
H  -4.818123 -0.02729 -1.41841
H  -0.68584 1.707401 -1.450892
H  3.221932 2.121419 1.513117
H  0.582694 3.789782 -1.424901
H  -0.03047 -3.87812 0.88371
H  -2.345821 -4.676847 -2.458897
elementType: Cl O N C H
totalener: -1777.72781673 hartree
nucrepener: 2020.69031225 hartree
electener: -3798.41812898 hartree
oneelecener: -6454.79033489 hartree
twoeener: 2656.37220591 hartree
cpcmener: -0.02333593 hartree
kineticenergy: 1772.81252775 hartree
xcener: -124.638949452161 hartree
chargesum: -0.0000000
charge: -0.074080 -0.081701 -0.381584 -0.365069 0.125597 -0.347111 -0.411820 0.573248 0.110796 0.020587 -0.114692 -0.096442 -0.131445 -0.262131 -0.012416 -0.162598 -0.155655 -0.180149 0.063351 0.116666 0.054425 0.081957 0.084060 0.118376 0.147770 0.129272 0.082125 0.062212 0.093042 0.083585 0.080190 0.158578 0.121303 0.144918 0.164258 0.160576
qa: -0.0741 -0.0817 -0.3816 -0.3651 0.1256 -0.3471 -0.4118 0.5732 0.1108 0.0206 -0.1147 -0.0964 -0.1314 -0.2621 -0.0124 -0.1626 -0.1557 -0.1801 0.0634 0.1167 0.0544 0.0820 0.0841 0.1184 0.1478 0.1293 0.0821 0.0622 0.0930 0.0836 0.0802 0.1586 0.1213 0.1449 0.1643 0.1606
va: 1.2463 1.2226 2.0021 1.9919 3.3796 2.8923 3.0325 3.8989 3.9319 3.9271 3.7908 3.5272 3.9339 3.9322 4.0045 3.9620 4.0845 4.0554 4.0716 3.8613 4.0538 1.0003 1.0071 0.9961 1.0166 1.0225 1.0108 1.0091 1.0039 1.0071 1.0028 1.0125 1.0262 1.0071 1.0060 0.9955
dispcorr: -0.020239311 hartree
energy: -1777.748056043328
dipole: -30.22216 29.85307 -0.36908 -6.34261 7.79311 1.45050 -6.64599 7.25580 0.60981
magnitude: 1.61618 au
magnitude: 4.10801 debye
