program: Orca
programVersion: 4.2.1
elementType: Cl Cl O O N N N C C C C C C C C C C C C C C H H H H H H H H H H H H H H H
charge: 0
multiplicity: 1
keywords: wb97x-d3
keywords: def2-TZVPP
keywords: def2/J RIJCOSX GRIDX6 NOFINALGRIDX
keywords: grid4 nofinalgrid
keywords: scfconv7
keywords: smallprint printgap noloewdin
keywords: NOSOSCF
formula: C14H15Cl2N3O2
InChI: InChI=1S/C14H15Cl2N3O2/c1-2-11-6-20-14(21-11,7-19-9-17-8-18-19)12-4-3-10(15)5-13(12)16/h3-5,8-9,11H,2,6-7H2,1H3
36 atoms
Cl 0.568124 0.735997 -2.356075
Cl 2.970532 4.439879 0.622797
O  -1.338612 -0.557035 -0.525486
O  -0.749799 -0.949857 1.607259
N  -0.047146 -3.032685 -0.356486
N  -0.247992 -3.937742 0.604634
N  -1.265422 -4.566511 -1.288464
C  -0.247976 -0.66945 0.336115
C  -2.566841 -0.763804 0.165566
C  -2.119417 -1.294344 1.526057
C  0.678509 -1.813121 -0.124803
C  0.557031 0.624565 0.381872
C  -3.407241 0.502198 0.210933
C  -2.777809 1.687507 0.925694
C  0.960179 1.304381 -0.766873
C  0.936864 1.164524 1.606825
C  1.700494 2.475451 -0.702054
C  1.674852 2.332156 1.70018
C  -0.664446 -3.417337 -1.477061
C  2.049745 2.98076 0.537423
C  -0.979975 -4.838997 0.000664
H  -3.1285 -1.5310 -0.374525
H  -2.650197 -0.829327 2.358835
H  -2.250301 -2.376231 1.607819
H  1.438165 -1.997495 0.63342
H  1.194809 -1.548036 -1.045408
H  -3.660996 0.785401 -0.814004
H  -4.354369 0.237733 0.690416
H  -2.536223 1.46959 1.96747
H  -1.865287 2.021993 0.432469
H  -3.468545 2.531609 0.93053
H  0.64692 0.667218 2.520945
H  1.996703 2.983497 -1.609285
H  1.948368 2.725712 2.669268
H  -0.639336 -2.84253 -2.389562
H  -1.31622 -5.731327 0.505643
elementType: Cl O N C H
totalener: -1777.72379095 hartree
nucrepener: 2048.42702227 hartree
electener: -3826.15081322 hartree
oneelecener: -6510.31469203 hartree
twoeener: 2684.16387880 hartree
cpcmener: -0.02170054 hartree
kineticenergy: 1772.80108711 hartree
xcener: -124.640893253458 hartree
chargesum: 0.0000000
charge: -0.073262 -0.082698 -0.385801 -0.386062 0.138321 -0.368850 -0.407149 0.586157 0.183476 -0.009543 -0.152004 -0.122190 -0.143570 -0.272951 0.000789 -0.134846 -0.151862 -0.169542 0.062434 0.114790 0.070299 0.091506 0.094355 0.089767 0.127904 0.147956 0.068584 0.074021 0.082825 0.083180 0.103735 0.147098 0.121291 0.145648 0.163867 0.162326
qa: -0.0733 -0.0827 -0.3858 -0.3861 0.1383 -0.3688 -0.4071 0.5862 0.1835 -0.0095 -0.1520 -0.1222 -0.1436 -0.2730 0.0008 -0.1348 -0.1519 -0.1695 0.0624 0.1148 0.0703 0.0915 0.0944 0.0898 0.1279 0.1480 0.0686 0.0740 0.0828 0.0832 0.1037 0.1471 0.1213 0.1456 0.1639 0.1623
va: 1.2461 1.2212 2.0027 1.9869 3.3516 2.8668 3.0313 3.8304 3.8327 3.9627 3.8372 3.4976 3.9481 3.9397 3.9655 3.9246 4.0895 4.0393 4.0668 3.8590 4.0257 0.9984 0.9987 1.0028 1.0267 1.0122 1.0112 1.0090 1.0053 0.9982 1.0049 1.0273 1.0260 1.0063 1.0041 0.9949
dispcorr: -0.021901472 hartree
energy: -1777.745692420734
dipole: -22.31177 21.89985 -0.41192 -10.17129 11.10437 0.93309 9.87466 -9.30231 0.57235
magnitude: 1.16958 au
magnitude: 2.97283 debye
