program: Orca
programVersion: 4.2.1
elementType: Cl Cl O O N N N C C C C C C C C C C C C C C H H H H H H H H H H H H H H H
charge: 0
multiplicity: 1
keywords: wb97x-d3
keywords: def2-TZVPP
keywords: def2/J RIJCOSX GRIDX6 NOFINALGRIDX
keywords: grid4 nofinalgrid
keywords: scfconv7
keywords: smallprint printgap noloewdin
keywords: NOSOSCF
formula: C14H15Cl2N3O2
InChI: InChI=1S/C14H15Cl2N3O2/c1-2-11-6-20-14(21-11,7-19-9-17-8-18-19)12-4-3-10(15)5-13(12)16/h3-5,8-9,11H,2,6-7H2,1H3
36 atoms
Cl 0.517389 0.97531 -2.350534
Cl 3.303447 4.262778 0.782427
O  -1.288273 -0.438751 -0.523632
O  -0.605299 -1.073045 1.511387
N  -0.121628 -3.009691 -0.486206
N  -0.171491 -3.947644 0.461723
N  -1.578068 -4.445243 -1.207942
C  -0.151575 -0.673775 0.256881
C  -2.456852 -0.4737 0.293248
C  -1.876983 -0.480838 1.700703
C  0.673968 -1.821757 -0.335293
C  0.707014 0.586406 0.352536
C  -3.362883 0.699966 -0.013327
C  -4.64841 0.642763 0.79918
C  1.045309 1.370903 -0.74919
C  1.219198 0.971262 1.587871
C  1.842651 2.49911 -0.62645
C  2.01272 2.095512 1.740621
C  -0.970608 -3.314215 -1.471694
C  2.316064 2.853929 0.624376
C  -1.052598 -4.787819 -0.014437
H  -2.993013 -1.411482 0.098887
H  -1.786587 0.534828 2.107603
H  -2.440958 -1.089445 2.405729
H  1.517526 -2.051235 0.314126
H  1.075603 -1.540434 -1.307313
H  -2.829054 1.633649 0.186565
H  -3.604852 0.695134 -1.078717
H  -5.308674 1.47004 0.538787
H  -5.196205 -0.283308 0.614383
H  -4.460648 0.706393 1.87293
H  0.994333 0.380278 2.464788
H  2.088447 3.089743 -1.498087
H  2.386647 2.367706 2.717745
H  -1.100307 -2.699974 -2.348655
H  -1.323274 -5.688755 0.514169
elementType: Cl O N C H
totalener: -1777.72778872 hartree
nucrepener: 2019.73337327 hartree
electener: -3797.46116198 hartree
oneelecener: -6452.84636484 hartree
twoeener: 2655.38520286 hartree
cpcmener: -0.02339290 hartree
kineticenergy: 1772.80741737 hartree
xcener: -124.638160313938 hartree
chargesum: -0.0000000
charge: -0.074405 -0.082541 -0.376522 -0.371947 0.134494 -0.349954 -0.412016 0.578768 0.167417 -0.035654 -0.124272 -0.091856 -0.115034 -0.276321 -0.053257 -0.135591 -0.143966 -0.182828 0.054321 0.113458 0.057144 0.082610 0.096321 0.122411 0.129377 0.149374 0.057777 0.070040 0.096746 0.086160 0.084115 0.152524 0.121694 0.145630 0.164942 0.160838
qa: -0.0744 -0.0825 -0.3765 -0.3719 0.1345 -0.3500 -0.4120 0.5788 0.1674 -0.0357 -0.1243 -0.0919 -0.1150 -0.2763 -0.0533 -0.1356 -0.1440 -0.1828 0.0543 0.1135 0.0571 0.0826 0.0963 0.1224 0.1294 0.1494 0.0578 0.0700 0.0967 0.0862 0.0841 0.1525 0.1217 0.1456 0.1649 0.1608
va: 1.2437 1.2215 2.0084 2.0100 3.3581 2.8944 3.0263 3.8803 3.8529 3.9238 3.7930 3.5753 3.9543 3.9509 4.0398 3.9184 4.0782 4.0453 4.0660 3.8649 4.0524 1.0001 0.9946 0.9956 1.0263 1.0122 1.0111 1.0116 1.0032 1.0016 1.0006 1.0216 1.0257 1.0070 1.0061 0.9951
dispcorr: -0.020051449 hartree
energy: -1777.747840164974
dipole: -26.70261 26.41533 -0.28728 -10.75881 12.13908 1.38026 9.23165 -8.56300 0.66865
magnitude: 1.56037 au
magnitude: 3.96614 debye
