program: Orca
programVersion: 4.2.1
elementType: Cl Cl O O N N N C C C C C C C C C C C C C C H H H H H H H H H H H H H H H
charge: 0
multiplicity: 1
keywords: wb97x-d3
keywords: def2-TZVPP
keywords: def2/J RIJCOSX GRIDX6 NOFINALGRIDX
keywords: grid4 nofinalgrid
keywords: scfconv7
keywords: smallprint printgap noloewdin
keywords: NOSOSCF
formula: C14H15Cl2N3O2
InChI: InChI=1S/C14H15Cl2N3O2/c1-2-11-6-20-14(21-11,7-19-9-17-8-18-19)12-4-3-10(15)5-13(12)16/h3-5,8-9,11H,2,6-7H2,1H3
36 atoms
Cl 0.416622 0.998857 -2.366539
Cl 3.193531 4.294088 0.766008
O  -1.309765 -0.510448 -0.5382
O  -0.59348 -1.127234 1.483459
N  -0.061247 -3.056269 -0.493963
N  -0.021064 -3.990226 0.458224
N  -1.466658 -4.571953 -1.14935
C  -0.159219 -0.712831 0.227991
C  -2.450366 -0.420749 0.313427
C  -1.840498 -0.497323 1.710723
C  0.686916 -1.833657 -0.382634
C  0.673449 0.566177 0.324825
C  -3.23754 0.845483 0.044353
C  -4.494313 0.915701 0.899999
C  0.968704 1.377907 -0.769287
C  1.20862 0.938315 1.554629
C  1.741401 2.523063 -0.642802
C  1.979887 2.077179 1.710772
C  -0.931189 -3.412171 -1.442967
C  2.236018 2.865305 0.603153
C  -0.875063 -4.878869 0.022546
H  -3.085806 -1.294159 0.124505
H  -1.706869 0.499612 2.150221
H  -2.415407 -1.107159 2.405808
H  1.561536 -2.022788 0.237758
H  1.041695 -1.5437 -1.370337
H  -2.603113 1.716485 0.233359
H  -3.513382 0.878094 -1.012232
H  -5.147861 0.060059 0.71988
H  -4.265532 0.9373 1.967513
H  -5.066233 1.816246 0.67623
H  1.02015 0.32467 2.424648
H  1.952896 3.135499 -1.508376
H  2.37219 2.338262 2.683718
H  -1.129346 -2.811458 -2.316365
H  -1.076412 -5.788666 0.566749
elementType: Cl O N C H
totalener: -1777.72765205 hartree
nucrepener: 2020.55872171 hartree
electener: -3798.28637376 hartree
oneelecener: -6454.47245849 hartree
twoeener: 2656.18608473 hartree
cpcmener: -0.02358570 hartree
kineticenergy: 1772.80811058 hartree
xcener: -124.638449249916 hartree
chargesum: 0.0000000
charge: -0.074176 -0.082358 -0.375734 -0.370382 0.131521 -0.350846 -0.414660 0.581972 0.182426 -0.046959 -0.118606 -0.111488 -0.122029 -0.274339 -0.042133 -0.141453 -0.144667 -0.184007 0.059915 0.114726 0.058679 0.087194 0.096885 0.123231 0.130451 0.148651 0.058115 0.068399 0.087008 0.083389 0.095844 0.153014 0.121254 0.145999 0.164622 0.160542
qa: -0.0742 -0.0824 -0.3757 -0.3704 0.1315 -0.3508 -0.4147 0.5820 0.1824 -0.0470 -0.1186 -0.1115 -0.1220 -0.2743 -0.0421 -0.1415 -0.1447 -0.1840 0.0599 0.1147 0.0587 0.0872 0.0969 0.1232 0.1305 0.1487 0.0581 0.0684 0.0870 0.0834 0.0958 0.1530 0.1213 0.1460 0.1646 0.1605
va: 1.2431 1.2216 2.0059 2.0106 3.3608 2.8913 3.0277 3.8838 3.8333 3.9260 3.7846 3.5701 3.9636 3.9512 4.0234 3.9264 4.0809 4.0462 4.0661 3.8641 4.0528 1.0009 0.9939 0.9954 1.0252 1.0124 1.0080 1.0124 1.0015 1.0011 1.0034 1.0214 1.0262 1.0068 1.0058 0.9950
dispcorr: -0.020072227 hartree
energy: -1777.747724272681
dipole: -25.56723 25.26180 -0.30543 -9.87971 11.37031 1.49061 9.64629 -8.98660 0.65969
magnitude: 1.65843 au
magnitude: 4.21539 debye
