program: Gaussian 09
title: 000003280
version: EM64L-G09RevD.01
frameworkgroup: C1[X(C24H29NO4)]
method: RPBEPBE
basis: SDD
operation: Freq
keyword: #p
keyword: freq=noraman
keyword: PBEPBE/SDD
title: #p freq=noraman PBEPBE/SDD
converged: YES YES NO NO
title: Mulliken charges:
elementType: O O O O N C C C C C C C C C C C C C C C C C C C C C C C C H H H H H H H H H H H H H H H H H H H H H H H H H H H H H
charge: -0.226246 -0.230952 -0.246228 -0.241703 -0.010732 0.214251 -0.657375 -0.001483 0.537193 0.589190 -0.557647 -0.602500 0.164564 0.209616 -0.359567 -0.495325 -0.507047 0.191022 -0.404444 0.187558 -0.346739 -0.243824 -0.241469 -0.240747 -0.240962 -0.683406 -0.683442 -0.687929 -0.686304 0.219404 0.227752 0.273854 0.255168 0.229944 0.252839 0.223893 0.237577 0.240935 0.210115 0.209946 0.210743 0.210352 0.213339 0.200105 0.204412 0.201925 0.207095 0.234160 0.234109 0.206521 0.234586 0.234321 0.200760 0.232614 0.230608 0.200634 0.231919 0.233048
chargesum: 0.00000
title: Mulliken charges with hydrogens summed into heavy atoms:
elementType: O O O O N C C C C C C C C C C C C C C C C C C C C C C C C
charge: -0.226246 -0.230952 -0.246228 -0.241703 -0.010732 0.214251 -0.210219 -0.001483 0.537193 0.589190 -0.283793 -0.347332 0.164564 0.209616 -0.129623 -0.242486 -0.283154 0.191022 -0.166868 0.187558 -0.105804 0.176236 0.179626 0.172696 0.165375 -0.008041 -0.008014 -0.023947 -0.020703
polarizability: 4.50034985e+02 1.51199117e+01 2.87421848e+02 1.67973467e+01 3.95680228e+00 1.98345076e+02
1716.lowfreq: -6.5079 -3.7937 -0.0011 0.0009 0.0013 0.9078 5.7428 11.8819 26.3143
frequency: 3.9777 11.8113 26.2948 38.0167 52.9576 60.0190 63.7597 79.2058 89.5068 95.0810 103.7267 108.1056 112.0835 118.0169 126.8017 138.8926 149.5806 152.2970 160.1721 189.0152 228.0009 239.9180 241.6574 243.9666 244.6569 265.4283 274.5976 281.9312 301.4334 312.6216 328.9013 330.2000 346.4164 358.3973 363.1389 388.5946 453.4604 454.6121 486.2518 511.7161 518.7129 536.7104 572.2414 575.4448 583.0140 590.9407 595.1077 644.4784 668.6685 719.0091 722.8284 732.0501 742.3633 753.8530 776.2078 789.8182 801.3984 810.8611 823.1982 825.5837 831.3553 832.6217 851.4374 862.5161 864.4607 869.3740 876.7092 883.8772 901.5360 907.2001 915.0181 942.5327 959.7841 971.4853 1002.5181 1032.1345 1033.2190 1035.7203 1037.8324 1069.9152 1112.8430 1116.0781 1116.1953 1116.8859 1129.9124 1134.7418 1134.7898 1135.3909 1135.9772 1143.9041 1166.5228 1192.4422 1208.0777 1219.2050 1234.0294 1250.4283 1259.9695 1260.4472 1260.5898 1262.5134 1263.4725 1269.7462 1283.4080 1288.7025 1334.7063 1357.7151 1365.2440 1367.7924 1368.1869 1382.3970 1387.5841 1394.8227 1397.5164 1399.4078 1401.1807 1405.2579 1417.8463 1426.0227 1455.7513 1458.7292 1459.0236 1459.3479 1460.2180 1460.6781 1475.0496 1476.5523 1477.0368 1478.0216 1486.6191 1487.6047 1487.8304 1489.9443 1510.1963 1513.3641 1557.0208 1575.0505 1593.7643 1615.2875 1619.7346 2941.8427 2945.6107 2948.7509 2952.7338 2956.4155 2995.3090 2995.9574 2998.2154 2998.3932 2999.0295 3001.7402 3006.9868 3011.6883 3015.9760 3092.3793 3093.0638 3095.8627 3096.2220 3105.1576 3105.7686 3108.2745 3109.3868 3123.1864 3124.4057 3149.6314 3156.7915 3160.5955 3166.6812 3177.6288
redmass: 4.7107 4.0059 4.3537 3.9142 4.1989 4.1948 3.3317 3.7546 2.6486 3.3278 2.8133 1.7308 1.9661 1.7970 2.0431 5.7847 4.1700 4.5747 4.9565 3.9015 3.5841 1.1850 1.2111 1.2527 1.2854 2.8991 3.4362 4.5355 4.8845 4.7551 3.5046 3.4990 3.6170 5.0966 5.1367 4.5587 3.2902 3.0902 5.8237 5.0268 5.2691 3.3147 5.8120 4.7997 5.3727 4.9226 4.8060 5.9544 5.7502 3.9323 4.6891 3.6529 3.2950 3.7806 2.1158 2.0597 2.2564 1.2664 1.1988 1.1845 1.1246 1.1392 1.7317 2.3901 1.9411 3.1273 3.4710 1.8754 2.9671 1.4663 3.8733 2.2317 1.5087 3.3146 3.1479 2.7666 2.6286 2.8020 2.7350 2.3136 2.3397 2.2048 2.2043 2.2074 2.5032 1.4395 1.4409 1.4389 1.4419 4.6352 1.8412 1.1230 1.7599 1.8411 2.2326 2.3854 1.1437 1.1463 1.1429 1.2032 2.5078 2.2779 1.5823 1.6928 2.9419 1.4936 1.3335 1.3838 1.3518 3.9857 2.7167 1.5365 1.2870 1.2967 1.3033 2.8180 3.5742 2.8125 3.2426 1.0436 1.2427 1.0403 1.0399 1.0396 1.0884 1.0935 1.1097 1.0602 1.0964 1.1222 1.1113 1.0916 2.3612 3.0819 7.5681 6.5310 7.1840 6.6428 6.5196 1.0634 1.0551 1.0556 1.0552 1.0553 1.0362 1.0362 1.0942 1.0362 1.0364 1.1072 1.1068 1.1074 1.1075 1.0988 1.0988 1.0989 1.0988 1.1012 1.1012 1.1014 1.1014 1.0891 1.0865 1.0987 1.0906 1.0933 1.0914 1.0898
irintensity: 0.1027 0.0347 0.7829 0.1251 1.7878 1.6665 2.9911 0.1855 0.2135 3.6951 1.5588 7.2836 1.3561 0.6821 0.0059 0.5806 0.1178 0.0307 0.4927 1.4070 0.6813 1.0797 0.8670 0.0479 0.1827 0.1507 3.5888 2.2691 2.1112 0.5105 0.1709 3.0500 2.8610 2.9772 0.9353 1.3412 1.0729 2.2694 6.8618 4.9215 3.0446 0.9316 18.2150 11.7802 7.2280 1.7880 6.1877 5.1490 2.3250 8.4599 1.5932 0.0334 9.1265 12.9279 0.9896 39.2013 16.8782 3.4952 9.2092 14.8127 1.5818 10.4996 3.1401 9.6394 27.0896 14.4473 10.1433 34.2521 27.9228 0.4106 75.7155 4.2353 5.2046 26.6453 9.7341 74.9128 45.3953 79.5394 26.5941 9.6331 10.3631 2.0804 4.3546 3.7183 274.0294 4.1250 2.1598 7.1290 3.9255 262.2739 25.9071 1.1358 114.3960 141.2869 186.7512 25.7042 2.2041 0.1819 0.1634 0.5516 47.3789 322.7960 38.5899 47.0984 26.4920 11.7381 13.8812 14.9596 6.9885 21.4487 24.4241 35.2476 9.7893 15.7900 39.5908 26.3010 35.6441 12.4148 118.7781 4.3192 75.8403 17.6501 3.5315 20.5193 22.1305 29.3117 29.2412 19.2708 24.6991 57.3067 4.6582 11.1112 211.1428 91.0372 51.8186 1.0000 37.2769 17.5381 52.7603 26.2449 53.8257 36.7078 29.9967 28.4921 28.4457 35.5585 12.5744 23.4004 29.8610 38.5737 35.2313 30.4813 35.0333 41.6088 20.3938 42.8055 7.9824 24.5070 42.4842 26.6825 35.6748 19.4493 2.1058 42.2571 20.5871 26.8921 2.4130 8.1900
temp: 298.150 k
press: 1.00000 atm
elementType: 8 8 8 8 7 6 6 6 6 6 6 6 6 6 6 6 6 6 6 6 6 6 6 6 6 6 6 6 6 1 1 1 1 1 1 1 1 1 1 1 1 1 1 1 1 1 1 1 1 1 1 1 1 1 1 1 1 1
symmnumber: 1
zpe: 1252080.0 jmol-1
zpe.correction: 0.476892 hartree
zpe.thermalcorrener: 0.506659 hartree
zpe.thermalcorrenthalpy: 0.507604 hartree
zpe.thermalcorrgfe: 0.412186 hartree
zpe.sumelectzpe: -1285.414749 hartree
zpe.sumelectthermal: -1285.384981 hartree
zpe.sumelectthermalent: -1285.384037 hartree
zpe.sumelectthermalfe: -1285.479455 hartree
dipole: 4.1587 0.6895 0.3764
dipole: 4.2323
quadrupole: -154.3637 -149.0020 -167.4606
quadrupole: -12.9773 2.0828 -1.5230
quadrupole: 2.5784 7.9401 -10.5185 -12.9773 2.0828 -1.5230
hfenergy: -1285.8916408 hartree
pointgroup: C01 [X(C24H29N1O4)]
dipole: -1.634024 -0.3201835 -0.0010097 debye
polarizability: 449.245242|24.846186|259.9354423|-10.5410938|40.8326896|226.6212256 unknown
InChI: InChI=1S/C24H29NO4/c1-5-26-21-10-9-17(14-22(21)27-6-2)13-20-19-16-24(29-8-4)23(28-7-3)15-18(19)11-12-25-20/h9-12,14-16H,5-8,13H2,1-4H3
charge 0 multiplicity 1
58 atoms
O  -4.759772 -1.820233 -0.167935
O  -6.075104 0.34431 0.525633
O  4.972754 0.242025 1.715141
O  6.14997 -0.166032 -0.628068
N  0.28553 1.753075 0.434987
C  -1.834811 0.535474 0.250417
C  0.40621 -0.628546 -0.245688
C  -0.39097 0.616217 0.163118
C  -2.564652 1.721393 0.631195
C  1.912433 -0.474449 -0.378773
C  -2.569706 -0.666676 -0.021639
C  -3.993074 1.672692 0.726537
C  -3.963188 -0.701709 0.076109
C  -4.692345 0.494073 0.458774
C  -1.81835 2.911717 0.903218
C  2.714271 -0.168964 0.751948
C  2.547786 -0.680606 -1.618658
C  4.115439 -0.067282 0.649089
C  -0.427769 2.879393 0.79709
C  4.751979 -0.282002 -0.616501
C  3.956462 -0.585129 -1.740853
C  -4.077899 -3.070223 -0.56338
C  -6.871997 1.526958 0.916348
C  4.351857 0.516272 3.023746
C  6.831608 -0.36868 -1.918389
C  -5.167878 -4.11806 -0.768062
C  -8.333225 1.088472 0.91902
C  5.490393 0.844352 3.986497
C  8.324388 -0.182725 -1.657656
H  0.179333 -1.42804 0.493126
H  0.000755 -0.994502 -1.210429
H  -2.025261 -1.568617 -0.307819
H  -4.524876 2.584173 1.015449
H  -2.33365 3.834213 1.192898
H  2.220066 0.020958 1.708141
H  1.948154 -0.912784 -2.506768
H  0.177439 3.769879 0.999732
H  4.420198 -0.749501 -2.717766
H  -3.370936 -3.370955 0.237394
H  -3.503213 -2.894543 -1.496272
H  -6.69425 2.344437 0.187539
H  -6.548146 1.869882 1.920599
H  3.644417 1.365756 2.927604
H  3.784827 -0.376603 3.361658
H  6.456853 0.369923 -2.657828
H  6.613489 -1.388722 -2.299194
H  -4.715816 -5.081295 -1.066793
H  -5.869976 -3.799341 -1.556887
H  -5.739189 -4.271267 0.162992
H  -8.982589 1.936372 1.203429
H  -8.634529 0.735042 -0.081504
H  -8.491449 0.267405 1.63843
H  5.088173 1.059955 4.993433
H  6.052457 1.726241 3.634916
H  6.191609 -0.004292 4.060699
H  8.895969 -0.323316 -2.593448
H  8.681228 -0.914249 -0.912812
H  8.525876 0.830291 -1.269884
