program: Gaussian 09
title: 000030238
version: EM64L-G09RevD.01
frameworkgroup: C1[X(C11H20O5)]
method: RPBEPBE
basis: SDD
operation: Freq
keyword: #pfreq=noraman
keyword: PBEPBE/SDD
title: #p freq=noraman PBEPBE/SDD
converged: YES YES NO NO
title: Mulliken charges:
elementType: O O O O O C C C C C C C C C C C H H H H H H H H H H H H H H H H H H H H
charge: -0.264549 -0.262990 -0.275782 -0.229947 -0.236607 0.062009 -0.399379 -0.710699 -0.312927 0.205826 0.218423 -0.223966 -0.221327 -0.498521 -0.671766 -0.674286 0.221840 0.239162 0.242763 0.216390 0.243249 0.216729 0.212645 0.228132 0.234831 0.225603 0.236576 0.199234 0.230185 0.200972 0.212957 0.230400 0.230227 0.213289 0.229083 0.232221
chargesum: 0.00000
title: Mulliken charges with hydrogens summed into heavy atoms:
elementType: O O O O O C C C C C C C C C C C
charge: -0.264549 -0.262990 -0.275782 -0.229947 -0.236607 0.062009 0.061623 -0.008297 0.116446 0.205826 0.218423 0.238997 0.240852 0.131870 0.001818 0.000307
polarizability: 1.64912505e+02 -3.22582659e+00 1.29643864e+02 2.94031673e+00 -4.38477574e-01 1.15596764e+02
1716.lowfreq: -20.6016 -4.9300 -0.0005 0.0002 0.0007 4.8145 9.6494 19.0042 37.3017
frequency: -18.9318 16.6263 37.1039 45.6932 53.1407 60.0723 87.5203 101.8710 112.3784 135.7103 141.0424 156.3097 195.3253 220.7574 222.2721 237.8622 239.1621 254.2245 265.3963 280.0298 290.8407 306.9850 326.9105 365.3875 386.2133 436.4658 499.4757 575.1671 633.2980 716.6730 730.5052 793.5565 797.4308 798.1676 800.3333 812.9893 841.8885 889.6010 901.9747 946.3487 1020.1385 1021.5679 1035.4599 1046.7637 1069.9642 1075.1716 1105.8899 1112.2518 1113.4402 1115.5663 1134.8021 1135.2809 1144.0086 1164.0845 1174.7835 1192.1803 1247.3817 1247.7420 1253.6927 1303.0985 1312.2103 1352.8937 1354.5143 1383.9467 1396.6010 1399.7117 1400.6421 1438.1996 1456.5192 1456.5948 1462.6640 1462.7530 1469.8175 1471.4975 1473.3634 1474.1773 1475.7436 1485.3638 1486.2294 1488.7929 1610.1284 1637.1348 2920.6473 2952.2244 2992.0288 2995.7500 2996.0418 2998.2708 3004.3246 3012.1154 3013.0811 3013.7670 3071.2549 3071.8503 3081.4279 3092.2532 3092.3979 3098.0722 3098.4283 3107.9659 3108.3346 3118.7781
redmass: 3.4273 3.5090 3.2157 2.9871 2.2198 2.6752 2.9602 4.1530 3.1233 2.6809 2.9672 3.0481 2.9466 1.1769 1.9002 1.2897 1.5137 1.7733 2.0953 2.9013 3.4161 4.9151 5.6316 3.4502 3.6375 3.4602 5.5452 4.6568 3.5922 5.7197 5.7161 3.1580 1.2993 1.1162 3.1590 1.5546 4.3254 5.1907 2.5323 1.8624 2.2210 2.2578 1.5256 4.5668 4.1600 4.9203 2.6789 2.2094 2.3197 1.2939 1.4839 1.4851 4.0782 1.7118 1.4345 3.7388 1.1398 1.1370 1.7768 1.2991 1.3442 1.3779 1.3876 1.2144 1.2806 1.2664 1.2712 1.1631 1.0537 1.0705 1.0404 1.0405 1.0624 1.0625 1.0589 1.0601 1.0608 1.0668 1.0701 1.0764 11.3761 11.3744 1.0345 1.0549 1.1022 1.0358 1.0359 1.0355 1.0981 1.0583 1.0591 1.0670 1.1063 1.1064 1.1021 1.0985 1.0985 1.0999 1.0970 1.1028 1.1028 1.1008
irintensity: 1.0689 1.3532 0.2341 2.0948 4.3801 3.4376 1.5433 0.6015 0.4419 8.0133 2.5008 3.0190 1.2349 3.2497 1.2483 0.0729 0.5561 1.1684 1.9739 0.3697 6.5297 0.7592 13.0571 11.9255 0.8945 5.1515 8.1477 10.9997 1.9158 3.8728 1.0576 3.7167 2.5183 3.2701 11.8050 1.0039 1.2877 19.1112 17.2652 5.4349 78.5220 13.6096 32.6368 51.1859 541.9321 286.3843 4.4363 4.1315 2.6400 16.0419 5.9602 5.5692 3.2681 2.3974 34.8001 4.7652 1.0578 0.4013 107.0588 32.0815 5.0880 0.2246 0.6721 15.9282 2.6649 35.5442 11.7036 0.1850 8.0625 6.8591 11.5959 11.8835 30.0251 4.7840 10.5678 5.8015 19.7997 11.6162 13.6827 7.3073 147.7213 178.0133 84.3026 39.8732 87.9129 23.1282 17.0021 17.8790 17.8092 17.3942 31.1683 19.1873 5.1103 5.1086 19.7502 30.4504 29.7625 25.0174 34.1423 40.5896 42.4288 15.6517
temp: 298.150 k
press: 1.00000 atm
elementType: 8 8 8 8 8 6 6 6 6 6 6 6 6 6 6 6 1 1 1 1 1 1 1 1 1 1 1 1 1 1 1 1 1 1 1 1
symmnumber: 1
zpe: 784836.9 jmol-1
zpe.correction: 0.298929 hartree
zpe.thermalcorrener: 0.318325 hartree
zpe.thermalcorrenthalpy: 0.319269 hartree
zpe.thermalcorrgfe: 0.249216 hartree
zpe.sumelectzpe: -805.974496 hartree
zpe.sumelectthermal: -805.955100 hartree
zpe.sumelectthermalent: -805.954156 hartree
zpe.sumelectthermalfe: -806.024209 hartree
dipole: -0.1556 0.6356 0.7119
dipole: 0.9670
quadrupole: -73.2292 -97.8947 -101.2587
quadrupole: 4.7131 2.9917 -8.2556
quadrupole: 17.5650 -7.1005 -10.4645 4.7131 2.9917 -8.2556
hfenergy: -806.2734249 hartree
pointgroup: C01 [X(C11H20O5)]
dipole: 0.0279258 -0.2655899 0.2709456 debye
polarizability: 163.2572835|-7.8920313|131.1626373|-3.5521723|1.4502396|115.7332122 unknown
InChI: InChI=1S/C11H20O5/c1-5-15-9(12)11(3,7-8-14-4)10(13)16-6-2/h5-8H2,1-4H3
charge 0 multiplicity 1
36 atoms
O  2.202015 0.647841 0.216061
O  -2.592294 0.6082 0.342132
O  0.827201 -3.264957 0.531349
O  0.800231 2.317113 -0.590409
O  -1.274242 0.184677 -1.522871
C  -0.186151 0.445095 0.692276
C  0.176037 -1.027608 1.068374
C  -0.516967 1.234704 1.994146
C  0.493594 -1.976337 -0.095048
C  0.954814 1.228818 0.006315
C  -1.371424 0.419446 -0.296736
C  3.374769 1.40883 -0.324746
C  -3.805389 0.523048 -0.533612
C  1.161254 -4.283102 -0.459545
C  4.619889 0.597053 0.01452
C  -5.010533 0.811946 0.354174
H  -0.668029 -1.450634 1.645289
H  1.054803 -1.003497 1.736052
H  -1.362109 0.761409 2.518325
H  0.363311 1.233479 2.661793
H  -0.789405 2.277339 1.761931
H  1.356307 -1.604107 -0.685936
H  -0.372339 -2.100775 -0.778325
H  3.378107 2.411242 0.14025
H  3.228577 1.53498 -1.412419
H  -3.836126 -0.487307 -0.980366
H  -3.689473 1.257349 -1.350596
H  2.046501 -3.990008 -1.064577
H  1.391659 -5.201949 0.102977
H  0.311645 -4.477281 -1.149579
H  5.518537 1.117775 -0.363679
H  4.725242 0.470709 1.10555
H  4.577886 -0.403578 -0.448573
H  -5.936757 0.759422 -0.246744
H  -5.08631 0.075661 1.172608
H  -4.941034 1.820103 0.796936
