program: Orca
programVersion: 4.2.1
elementType: Cl Cl O O N N N C C C C C C C C C C C C C C H H H H H H H H H H H H H H H
charge: 0
multiplicity: 1
keywords: wb97x-d3
keywords: def2-TZVPP
keywords: def2/J RIJCOSX GRIDX6 NOFINALGRIDX
keywords: grid4 nofinalgrid
keywords: scfconv7
keywords: smallprint printgap noloewdin
keywords: NOSOSCF
formula: C14H15Cl2N3O2
InChI: InChI=1S/C14H15Cl2N3O2/c1-2-11-6-20-14(21-11,7-19-9-17-8-18-19)12-4-3-10(15)5-13(12)16/h3-5,8-9,11H,2,6-7H2,1H3
36 atoms
Cl -0.44264 0.980976 -2.405256
Cl 3.729626 2.557444 0.506574
O  -2.456319 0.012964 -0.420679
O  -1.725655 -1.081803 1.40113
N  0.123588 -2.552103 -0.504914
N  0.334175 -3.236303 0.620655
N  2.225752 -3.083439 -0.568612
C  -1.366985 -0.679737 0.10902
C  -3.307683 0.415678 0.648646
C  -3.067854 -0.697534 1.654965
C  -1.135603 -1.914525 -0.784154
C  -0.104246 0.177567 0.191719
C  -2.982874 1.806177 1.171232
C  -3.040278 2.88039 0.098012
C  0.375663 0.931516 -0.877049
C  0.65765 0.176126 1.357062
C  1.546823 1.669679 -0.789211
C  1.832273 0.898983 1.47214
C  1.260638 -2.46191 -1.19997
C  2.266137 1.645964 0.391912
C  1.605318 -3.535284 0.538904
H  -4.330218 0.397538 0.2638
H  -3.153337 -0.372322 2.692933
H  -3.748218 -1.540682 1.498114
H  -1.137021 -1.627641 -1.833874
H  -1.945738 -2.629248 -0.634706
H  -3.711797 2.03213 1.954897
H  -2.002946 1.812547 1.657922
H  -2.841807 3.864092 0.524335
H  -2.303894 2.710207 -0.686971
H  -4.024233 2.921626 -0.373966
H  0.331332 -0.406194 2.205941
H  1.890952 2.249383 -1.634478
H  2.397078 0.871486 2.393519
H  1.331856 -1.949295 -2.146962
H  2.104383 -4.10971 1.30407
elementType: Cl O N C H
totalener: -1777.72428205 hartree
nucrepener: 2086.08773593 hartree
electener: -3863.81201799 hartree
oneelecener: -6586.14781335 hartree
twoeener: 2722.33579537 hartree
cpcmener: -0.02473219 hartree
kineticenergy: 1772.80333559 hartree
xcener: -124.639305316125 hartree
chargesum: -0.0000000
charge: -0.075099 -0.082572 -0.369259 -0.382661 0.130269 -0.346852 -0.398855 0.563584 0.177904 0.010546 -0.155986 -0.059676 -0.161658 -0.273392 -0.068926 -0.172460 -0.102210 -0.152471 0.069168 0.096415 0.057678 0.106124 0.092518 0.089965 0.137626 0.122560 0.081454 0.076108 0.094674 0.076356 0.084230 0.143544 0.120288 0.146588 0.165131 0.159346
qa: -0.0751 -0.0826 -0.3693 -0.3827 0.1303 -0.3469 -0.3989 0.5636 0.1779 0.0105 -0.1560 -0.0597 -0.1617 -0.2734 -0.0689 -0.1725 -0.1022 -0.1525 0.0692 0.0964 0.0577 0.1061 0.0925 0.0900 0.1376 0.1226 0.0815 0.0761 0.0947 0.0764 0.0842 0.1435 0.1203 0.1466 0.1651 0.1593
va: 1.2403 1.2217 2.0158 1.9800 3.3395 2.8837 3.0338 3.8450 3.8885 4.0025 3.9294 3.4785 3.9090 3.9448 3.9663 3.9052 4.0563 4.0370 4.0559 3.8790 4.0551 0.9930 0.9917 0.9964 1.0096 1.0163 1.0108 1.0004 1.0057 1.0149 1.0020 1.0349 1.0240 1.0037 0.9994 0.9964
dispcorr: -0.022474926 hartree
energy: -1777.746756980643
dipole: -24.30609 22.23052 -2.07557 -0.99432 1.75175 0.75744 9.40140 -9.06030 0.34110
magnitude: 2.23563 au
magnitude: 5.68251 debye
