program: Orca
programVersion: 4.2.1
elementType: Cl Cl O O N N N C C C C C C C C C C C C C C H H H H H H H H H H H H H H H
charge: 0
multiplicity: 1
keywords: wb97x-d3
keywords: def2-TZVPP
keywords: def2/J RIJCOSX GRIDX6 NOFINALGRIDX
keywords: grid4 nofinalgrid
keywords: scfconv7
keywords: smallprint printgap noloewdin
keywords: NOSOSCF
formula: C14H15Cl2N3O2
InChI: InChI=1S/C14H15Cl2N3O2/c1-2-11-6-20-14(21-11,7-19-9-17-8-18-19)12-4-3-10(15)5-13(12)16/h3-5,8-9,11H,2,6-7H2,1H3
36 atoms
Cl -0.520537 0.928591 -2.428141
Cl 3.65922 2.645407 0.392014
O  -2.463342 0.00064 -0.402934
O  -1.751727 -1.049584 1.437245
N  0.117928 -2.582106 -0.42928
N  0.363363 -3.257921 0.696208
N  2.227241 -3.093591 -0.542245
C  -1.376566 -0.693358 0.144076
C  -3.353593 0.389382 0.634139
C  -2.605565 -0.026777 1.898207
C  -1.155635 -1.970669 -0.682194
C  -0.115248 0.16983 0.168483
C  -3.722885 1.861656 0.544148
C  -2.55353 2.831485 0.452816
C  0.32396 0.924937 -0.915533
C  0.685571 0.168712 1.306729
C  1.478131 1.690406 -0.853832
C  1.844446 0.919309 1.392701
C  1.244932 -2.483669 -1.151165
C  2.228143 1.688251 0.308556
C  1.636516 -3.547866 0.583383
H  -4.270698 -0.205089 0.538437
H  -2.038046 0.804109 2.335212
H  -3.259099 -0.438502 2.666731
H  -1.205461 -1.720063 -1.74052
H  -1.950025 -2.6829 -0.459897
H  -4.372575 2.004436 -0.32225
H  -4.341296 2.094386 1.417166
H  -2.918421 3.85836 0.45647
H  -1.856074 2.737405 1.285665
H  -1.991526 2.687917 -0.467848
H  0.397025 -0.446139 2.147503
H  1.789228 2.274539 -1.708038
H  2.444901 0.898337 2.290911
H  1.294198 -1.969191 -2.099109
H  2.158938 -4.114381 1.338228
totalener: -1777.69806667 hartree
nucrepener: 2089.21271189 hartree
electener: -3866.91077856 hartree
oneelecener: -6591.89167649 hartree
twoeener: 2724.98089793 hartree
kineticenergy: 1772.81289889 hartree
xcener: -124.639867028167 hartree
chargesum: 0.0000000
charge: -0.062606 -0.065183 -0.347988 -0.326035 0.116022 -0.304973 -0.322354 0.629163 0.142492 -0.055680 -0.144755 -0.127863 -0.126861 -0.271553 -0.123410 -0.143796 -0.084003 -0.132424 0.044700 0.090609 0.056597 0.079445 0.084257 0.101049 0.130646 0.107837 0.074053 0.063304 0.099060 0.073160 0.094559 0.144738 0.112513 0.125675 0.139921 0.129682
qa: -0.0626 -0.0652 -0.3480 -0.3260 0.1160 -0.3050 -0.3224 0.6292 0.1425 -0.0557 -0.1448 -0.1279 -0.1269 -0.2716 -0.1234 -0.1438 -0.0840 -0.1324 0.0447 0.0906 0.0566 0.0794 0.0843 0.1010 0.1306 0.1078 0.0741 0.0633 0.0991 0.0732 0.0946 0.1447 0.1125 0.1257 0.1399 0.1297
va: 1.2558 1.2405 2.0427 2.0383 3.3242 2.8627 3.0646 3.7379 3.9300 3.9874 3.9049 3.5299 3.9037 3.9479 4.0102 3.8777 4.0376 4.0478 4.0686 3.9556 4.0506 0.9994 0.9941 0.9995 1.0105 1.0330 1.0075 1.0108 1.0071 1.0064 1.0117 1.0297 1.0258 1.0119 1.0069 1.0021
dispcorr: -0.022840888 hartree
energy: -1777.720907554353
dipole: -23.00087 21.58084 -1.42003 0.08649 0.71566 0.80215 10.15084 -9.80133 0.34951
magnitude: 1.66796 au
magnitude: 4.23962 debye
