program: Orca
programVersion: 4.2.1
elementType: Cl Cl O O N N N C C C C C C C C C C C C C C H H H H H H H H H H H H H H H
charge: 0
multiplicity: 1
keywords: wb97x-d3
keywords: def2-TZVPP
keywords: def2/J RIJCOSX GRIDX6 NOFINALGRIDX
keywords: grid4 nofinalgrid
keywords: scfconv7
keywords: smallprint printgap noloewdin
keywords: NOSOSCF
formula: C14H15Cl2N3O2
InChI: InChI=1S/C14H15Cl2N3O2/c1-2-11-6-20-14(21-11,7-19-9-17-8-18-19)12-4-3-10(15)5-13(12)16/h3-5,8-9,11H,2,6-7H2,1H3
36 atoms
Cl 0.349226 1.173201 -2.189864
Cl 3.469343 4.168627 0.919606
O  -1.337806 -0.301013 -0.308991
O  -0.497215 -1.120849 1.607514
N  -0.240147 -2.924841 -0.543358
N  -0.974378 -3.115784 -1.643317
N  -1.395777 -4.719892 -0.133079
C  -0.152114 -0.634027 0.339408
C  -2.449726 -0.660057 0.494906
C  -1.825474 -0.725616 1.87945
C  0.590898 -1.764264 -0.390531
C  0.747511 0.591846 0.451767
C  -3.55671 0.360846 0.340891
C  -4.094471 0.449337 -1.079978
C  1.016471 1.44276 -0.619823
C  1.36629 0.877168 1.66446
C  1.850083 2.542538 -0.479997
C  2.202032 1.968319 1.827308
C  -0.510829 -3.888278 0.351484
C  2.43524 2.800248 0.746854
C  -1.648921 -4.200772 -1.354399
H  -2.818933 -1.650521 0.193307
H  -1.855391 0.251303 2.3797
H  -2.286078 -1.468694 2.53017
H  1.484448 -2.030017 0.177006
H  0.90313 -1.441735 -1.381313
H  -4.364315 0.084697 1.025781
H  -3.190422 1.338384 0.667326
H  -4.474856 -0.514606 -1.420724
H  -4.91185 1.167258 -1.140785
H  -3.319169 0.764682 -1.776596
H  1.186057 0.229219 2.510453
H  2.038237 3.189332 -1.324965
H  2.664536 2.167101 2.783603
H  -0.04028 -3.943147 1.320393
H  -2.340783 -4.642764 -2.054045
totalener: -1777.70233800 hartree
nucrepener: 2029.63053140 hartree
electener: -3807.33286940 hartree
oneelecener: -6472.67774025 hartree
twoeener: 2665.34487085 hartree
kineticenergy: 1772.80992853 hartree
xcener: -124.636442113156 hartree
chargesum: 0.0000000
charge: -0.048925 -0.065627 -0.334181 -0.373637 0.104208 -0.294166 -0.327645 0.570053 0.127382 -0.007630 -0.134683 -0.080196 -0.134187 -0.232038 -0.051500 -0.119536 -0.147445 -0.167650 0.027734 0.107854 0.045775 0.074166 0.081277 0.102772 0.123947 0.135167 0.063221 0.056596 0.072176 0.083484 0.092417 0.138086 0.114144 0.124809 0.143217 0.130561
qa: -0.0489 -0.0656 -0.3342 -0.3736 0.1042 -0.2942 -0.3276 0.5701 0.1274 -0.0076 -0.1347 -0.0802 -0.1342 -0.2320 -0.0515 -0.1195 -0.1474 -0.1677 0.0277 0.1079 0.0458 0.0742 0.0813 0.1028 0.1239 0.1352 0.0632 0.0566 0.0722 0.0835 0.0924 0.1381 0.1141 0.1248 0.1432 0.1306
va: 1.2713 1.2397 2.0444 1.9904 3.3602 2.8572 3.0553 3.8348 3.9048 3.9640 3.8283 3.6222 3.9680 3.9348 4.0912 3.9168 4.0717 4.0588 4.0788 3.9269 4.0466 0.9938 1.0027 1.0003 1.0080 1.0315 1.0100 1.0171 1.0071 1.0041 1.0131 1.0274 1.0276 1.0147 1.0102 1.0026
dispcorr: -0.020381687 hartree
energy: -1777.722719686298
dipole: -25.15879 25.13657 -0.02221 -13.32247 13.94773 0.62526 5.99699 -4.94356 1.05343
magnitude: 1.22522 au
magnitude: 3.11425 debye
