program: Orca
programVersion: 4.2.1
elementType: Cl Cl O O N N N C C C C C C C C C C C C C C H H H H H H H H H H H H H H H
charge: 0
multiplicity: 1
keywords: wb97x-d3
keywords: def2-TZVPP
keywords: def2/J RIJCOSX GRIDX6 NOFINALGRIDX
keywords: grid4 nofinalgrid
keywords: scfconv7
keywords: smallprint printgap noloewdin
keywords: NOSOSCF
formula: C14H15Cl2N3O2
InChI: InChI=1S/C14H15Cl2N3O2/c1-2-11-6-20-14(21-11,7-19-9-17-8-18-19)12-4-3-10(15)5-13(12)16/h3-5,8-9,11H,2,6-7H2,1H3
36 atoms
Cl 0.602851 0.926069 -2.2846
Cl 2.956732 4.348521 1.048854
O  -1.240749 -0.623602 -0.607882
O  -0.721532 -1.157009 1.485893
N  0.033344 -3.122511 -0.426356
N  -0.344695 -3.508189 -1.648733
N  -1.086596 -4.957203 -0.106628
C  -0.170371 -0.769509 0.261644
C  -2.40057 -0.281702 0.129926
C  -1.975438 -0.516974 1.590115
C  0.747469 -1.894453 -0.223858
C  0.625889 0.527506 0.419529
C  -2.85563 1.139619 -0.153242
C  -4.169528 1.464467 0.544377
C  0.992808 1.338159 -0.654228
C  1.03923 0.925384 1.687705
C  1.706955 2.512649 -0.46511
C  1.754442 2.090543 1.900856
C  -0.42622 -3.995843 0.483594
C  2.077331 2.884865 0.814706
C  -1.009359 -4.610078 -1.409884
H  -3.190203 -0.981062 -0.165123
H  -1.887203 0.430459 2.137389
H  -2.653164 -1.169841 2.139693
H  1.543272 -2.041718 0.508335
H  1.208986 -1.623063 -1.170828
H  -2.077745 1.842491 0.160048
H  -2.96947 1.263279 -1.232018
H  -4.087351 1.399321 1.631086
H  -4.496216 2.476355 0.309086
H  -4.964284 0.784169 0.234046
H  0.789047 0.307007 2.538617
H  1.971026 3.1273 -1.313826
H  2.054573 2.375689 2.899138
H  -0.249376 -3.896008 1.542523
H  -1.450608 -5.191097 -2.204381
totalener: -1777.70020096 hartree
nucrepener: 2028.49392090 hartree
electener: -3806.19412186 hartree
oneelecener: -6470.25314663 hartree
twoeener: 2664.05902477 hartree
kineticenergy: 1772.81606830 hartree
xcener: -124.638391028841 hartree
chargesum: 0.0000000
charge: -0.040638 -0.063477 -0.327257 -0.366276 0.109379 -0.292359 -0.336638 0.577213 0.199933 -0.066782 -0.115311 -0.175852 -0.149662 -0.255007 -0.028014 -0.132285 -0.144554 -0.172748 0.036982 0.112037 0.052699 0.089608 0.086930 0.106990 0.127895 0.131982 0.057591 0.077283 0.072471 0.093255 0.083209 0.142508 0.113761 0.125652 0.139367 0.130116
qa: -0.0406 -0.0635 -0.3273 -0.3663 0.1094 -0.2924 -0.3366 0.5772 0.1999 -0.0668 -0.1153 -0.1759 -0.1497 -0.2550 -0.0280 -0.1323 -0.1446 -0.1727 0.0370 0.1120 0.0527 0.0896 0.0869 0.1070 0.1279 0.1320 0.0576 0.0773 0.0725 0.0933 0.0832 0.1425 0.1138 0.1257 0.1394 0.1301
va: 1.2800 1.2419 2.0483 1.9912 3.3615 2.8796 3.0619 3.8531 3.8476 3.9483 3.7992 3.5838 3.9618 3.9482 4.0535 3.9326 4.0708 4.0651 4.0877 3.9223 4.0597 0.9982 0.9944 0.9976 1.0044 1.0329 1.0031 1.0157 1.0046 1.0057 1.0040 1.0241 1.0296 1.0144 1.0122 1.0013
dispcorr: -0.020425123 hartree
energy: -1777.720626082701
dipole: -24.21035 24.00614 -0.20421 -8.18804 9.38042 1.19239 8.93676 -7.84590 1.09086
magnitude: 1.62894 au
magnitude: 4.14045 debye
