program: Orca
programVersion: 4.2.1
elementType: Cl Cl O O N N N C C C C C C C C C C C C C C H H H H H H H H H H H H H H H
charge: 0
multiplicity: 1
keywords: wb97x-d3
keywords: def2-TZVPP
keywords: def2/J RIJCOSX GRIDX6 NOFINALGRIDX
keywords: grid4 nofinalgrid
keywords: scfconv7
keywords: smallprint printgap noloewdin
keywords: NOSOSCF
formula: C14H15Cl2N3O2
InChI: InChI=1S/C14H15Cl2N3O2/c1-2-11-6-20-14(21-11,7-19-9-17-8-18-19)12-4-3-10(15)5-13(12)16/h3-5,8-9,11H,2,6-7H2,1H3
36 atoms
Cl -0.513629 1.083039 -2.393956
Cl 3.639939 2.71059 0.512217
O  -2.449701 -0.033416 -0.406678
O  -1.653122 -1.196941 1.336385
N  0.116644 -2.617476 -0.483235
N  1.282804 -2.386277 -1.094761
N  1.563452 -3.815816 0.609264
C  -1.325902 -0.707138 0.060587
C  -3.196558 0.422792 0.707985
C  -2.883612 -0.644541 1.757682
C  -1.070585 -1.904869 -0.867152
C  -0.089773 0.183485 0.155188
C  -2.837472 1.836784 1.143487
C  -3.037444 2.872639 0.048718
C  0.337762 0.998977 -0.889902
C  0.696229 0.156348 1.302482
C  1.475896 1.782645 -0.784066
C  1.842505 0.920791 1.429029
C  0.305076 -3.466778 0.53871
C  2.221264 1.73909 0.380233
C  2.118804 -3.125953 -0.410129
H  -4.248975 0.397178 0.410885
H  -2.777262 -0.227247 2.762088
H  -3.651256 -1.423732 1.789953
H  -0.941222 -1.57733 -1.895764
H  -1.933077 -2.572224 -0.825911
H  -3.472251 2.080951 2.001229
H  -1.807964 1.870683 1.510292
H  -2.798263 3.870825 0.413784
H  -2.402143 2.67393 -0.812433
H  -4.07188 2.889303 -0.299177
H  0.407171 -0.484451 2.122631
H  1.77965 2.41178 -1.608296
H  2.433908 0.875055 2.332334
H  -0.490689 -3.797805 1.187032
H  3.167851 -3.173751 -0.656152
totalener: -1777.69963210 hartree
nucrepener: 2084.61060557 hartree
electener: -3862.31023767 hartree
oneelecener: -6582.85993949 hartree
twoeener: 2720.54970182 hartree
kineticenergy: 1772.81019278 hartree
xcener: -124.639653177534 hartree
chargesum: -0.0000000
charge: -0.066101 -0.068726 -0.333398 -0.371996 0.113882 -0.302708 -0.328317 0.547593 0.181030 -0.014742 -0.121892 -0.141121 -0.185202 -0.251381 0.004660 -0.125753 -0.128879 -0.154622 0.038340 0.107049 0.060289 0.091642 0.077659 0.081179 0.133354 0.108519 0.070293 0.084717 0.087935 0.093468 0.072952 0.133841 0.109868 0.125014 0.140645 0.130913
qa: -0.0661 -0.0687 -0.3334 -0.3720 0.1139 -0.3027 -0.3283 0.5476 0.1810 -0.0147 -0.1219 -0.1411 -0.1852 -0.2514 0.0047 -0.1258 -0.1289 -0.1546 0.0383 0.1070 0.0603 0.0916 0.0777 0.0812 0.1334 0.1085 0.0703 0.0847 0.0879 0.0935 0.0730 0.1338 0.1099 0.1250 0.1406 0.1309
va: 1.2549 1.2369 2.0471 1.9820 3.3150 2.8573 3.0660 3.8734 3.8906 4.0156 3.8804 3.5803 3.9272 3.9458 3.9819 3.8792 4.0952 4.0760 4.0863 3.9270 4.0460 0.9909 0.9903 0.9940 1.0298 1.0185 1.0118 0.9977 1.0068 1.0220 1.0052 1.0302 1.0280 1.0122 1.0140 1.0021
dispcorr: -0.022412691 hartree
energy: -1777.722044791137
dipole: -23.77240 22.05113 -1.72127 -1.85648 2.33884 0.48236 10.51437 -9.79803 0.71634
magnitude: 1.92577 au
magnitude: 4.89492 debye
