program: Orca
programVersion: 4.2.1
elementType: Cl Cl O O N N N C C C C C C C C C C C C C C H H H H H H H H H H H H H H H
charge: 0
multiplicity: 1
keywords: wb97x-d3
keywords: def2-TZVPP
keywords: def2/J RIJCOSX GRIDX6 NOFINALGRIDX
keywords: grid4 nofinalgrid
keywords: scfconv7
keywords: smallprint printgap noloewdin
keywords: NOSOSCF
formula: C14H15Cl2N3O2
InChI: InChI=1S/C14H15Cl2N3O2/c1-2-11-6-20-14(21-11,7-19-9-17-8-18-19)12-4-3-10(15)5-13(12)16/h3-5,8-9,11H,2,6-7H2,1H3
36 atoms
Cl 0.432921 1.002695 -2.448551
Cl 3.056569 4.379154 0.725375
O  -1.388572 -0.433168 -0.626418
O  -0.671155 -1.036527 1.416667
N  -0.051737 -3.039524 -0.415852
N  -0.957038 -3.404909 -1.328261
N  -0.821175 -4.943459 0.299009
C  -0.250831 -0.64524 0.142918
C  -2.567195 -0.723634 0.10216
C  -2.040347 -1.383802 1.378222
C  0.613248 -1.767819 -0.470869
C  0.581465 0.626509 0.257786
C  -3.403932 0.52757 0.327787
C  -2.70464 1.651632 1.078192
C  0.923032 1.411187 -0.842506
C  1.048072 1.036184 1.503072
C  1.681223 2.565054 -0.703703
C  1.808352 2.180719 1.664649
C  0.011197 -3.966991 0.55162
C  2.117573 2.943805 0.552633
C  -1.389363 -4.550937 -0.861575
H  -3.151218 -1.441019 -0.481527
H  -2.521682 -1.005159 2.282655
H  -2.168734 -2.470263 1.356973
H  1.546725 -1.8459 0.087955
H  0.855969 -1.543716 -1.507313
H  -3.741872 0.895723 -0.643873
H  -4.309179 0.223413 0.86265
H  -1.845277 2.027745 0.525156
H  -3.386257 2.488717 1.226712
H  -2.354453 1.344205 2.064656
H  0.799882 0.451027 2.376313
H  1.924163 3.15997 -1.572477
H  2.151219 2.476173 2.646048
H  0.669309 -3.88655 1.402888
H  -2.135719 -5.130762 -1.381718
totalener: -1777.69839129 hartree
nucrepener: 2048.40210562 hartree
electener: -3826.10049690 hartree
oneelecener: -6510.18041936 hartree
twoeener: 2684.07992246 hartree
kineticenergy: 1772.80875094 hartree
xcener: -124.640273109240 hartree
chargesum: 0.0000000
charge: -0.047254 -0.066070 -0.340860 -0.378815 0.116184 -0.312845 -0.330356 0.565928 0.172615 -0.033049 -0.145496 -0.134198 -0.147826 -0.260033 0.016868 -0.122815 -0.154555 -0.154553 0.029212 0.111523 0.058172 0.083961 0.085940 0.095740 0.118360 0.131881 0.073920 0.062254 0.091114 0.098852 0.073485 0.133602 0.112415 0.124156 0.139957 0.132584
qa: -0.0473 -0.0661 -0.3409 -0.3788 0.1162 -0.3128 -0.3304 0.5659 0.1726 -0.0330 -0.1455 -0.1342 -0.1478 -0.2600 0.0169 -0.1228 -0.1546 -0.1546 0.0292 0.1115 0.0582 0.0840 0.0859 0.0957 0.1184 0.1319 0.0739 0.0623 0.0911 0.0989 0.0735 0.1336 0.1124 0.1242 0.1400 0.1326
va: 1.2746 1.2392 2.0382 1.9878 3.3628 2.8557 3.0510 3.8300 3.8620 3.9792 3.8638 3.5357 3.9401 3.9423 4.0106 3.9275 4.0928 4.0507 4.0707 3.9212 4.0220 1.0055 0.9999 0.9940 1.0055 1.0324 1.0111 1.0105 1.0003 1.0066 1.0080 1.0329 1.0298 1.0138 1.0073 1.0023
dispcorr: -0.021852527 hartree
energy: -1777.720243814181
dipole: -21.45281 21.32855 -0.12426 -11.38271 11.92928 0.54656 11.10004 -10.31259 0.78745
magnitude: 0.96657 au
magnitude: 2.45683 debye
