program: Orca
programVersion: 4.2.1
elementType: Cl F O N N N C C C C C C C C C C C C C C C C C H H H H H H H H H H H H H
charge: 0
multiplicity: 1
keywords: wb97x-d3
keywords: def2-TZVPP
keywords: def2/J RIJCOSX GRIDX6 NOFINALGRIDX
keywords: grid4 nofinalgrid
keywords: scfconv7
keywords: smallprint printgap noloewdin
keywords: NOSOSCF
formula: C17H13ClFN3O
InChI: InChI=1S/C17H13ClFN3O/c18-15-4-2-1-3-14(15)16-17(23-16,9-22-11-20-10-21-22)12-5-7-13(19)8-6-12/h1-8,10-11,16H,9H2
36 atoms
Cl -1.179444 0.783717 2.909731
F  5.453962 -0.656794 0.403075
O  -0.31178 1.372475 -1.273906
N  -0.375763 -1.824467 -1.513384
N  0.113717 -3.019824 -1.174759
N  0.313638 -2.688276 -3.382735
C  0.004217 0.309421 -0.392867
C  -0.579678 1.565843 0.096677
C  -0.880084 -0.911677 -0.520133
C  1.459037 0.050508 -0.189124
C  -2.003839 1.675727 0.504884
C  1.882439 -0.824302 0.807074
C  2.410404 0.677272 -0.984291
C  -2.382549 1.35872 1.804334
C  -2.982786 2.109871 -0.380709
C  3.229115 -1.065803 1.014694
C  3.763118 0.443266 -0.789614
C  -0.243046 -1.638828 -2.834564
C  -3.696433 1.471622 2.225519
C  -4.302145 2.228959 0.026536
C  4.151767 -0.425969 0.209097
C  -4.657504 1.911664 1.328769
C  0.513227 -3.502559 -2.326166
H  0.102114 2.248535 0.604309
H  -1.90001 -0.617872 -0.770201
H  -0.921589 -1.456451 0.421419
H  1.162078 -1.3284 1.437787
H  2.098385 1.354505 -1.767167
H  -2.7020 2.354988 -1.396371
H  3.559324 -1.74578 1.787968
H  4.505366 0.926172 -1.410542
H  -0.561756 -0.740273 -3.340349
H  -3.963138 1.213322 3.240892
H  -5.052574 2.570554 -0.673247
H  -5.685674 2.001896 1.651983
H  0.96379 -4.479103 -2.406957
totalener: -1455.20500038 hartree
nucrepener: 2011.72825476 hartree
electener: -3466.93325515 hartree
oneelecener: -5987.86489113 hartree
twoeener: 2520.93163599 hartree
kineticenergy: 1450.54374018 hartree
xcener: -115.877969511965 hartree
chargesum: -0.0000000
charge: -0.069176 -0.201387 -0.385871 0.119928 -0.313970 -0.331936 0.310105 0.088770 -0.097615 0.026644 0.018208 -0.200623 -0.142717 -0.025467 -0.138622 -0.165770 -0.175867 0.037900 -0.143565 -0.128003 0.274939 -0.112048 0.069100 0.130669 0.137001 0.116241 0.106317 0.133406 0.138159 0.124631 0.126093 0.150245 0.124697 0.133952 0.133527 0.132101
qa: -0.0692 -0.2014 -0.3859 0.1199 -0.3140 -0.3319 0.3101 0.0888 -0.0976 0.0266 0.0182 -0.2006 -0.1427 -0.0255 -0.1386 -0.1658 -0.1759 0.0379 -0.1436 -0.1280 0.2749 -0.1120 0.0691 0.1307 0.1370 0.1162 0.1063 0.1334 0.1382 0.1246 0.1261 0.1502 0.1247 0.1340 0.1335 0.1321
va: 1.2671 1.0882 2.0040 3.3428 2.8672 3.0685 3.6502 3.8465 3.8370 3.4899 3.4987 3.9915 3.9371 4.0205 3.9352 3.9404 3.9174 4.0735 4.0194 3.9631 3.9949 3.9518 4.0486 0.9929 0.9917 1.0203 1.0235 1.0244 1.0171 1.0061 1.0078 1.0054 1.0121 0.9999 0.9977 1.0007
dispcorr: -0.019609158 hartree
energy: -1455.224609541024
dipole: -11.26804 9.79006 -1.47798 1.71509 -0.59487 1.12023 -6.72793 7.49380 0.76586
magnitude: 2.00646 au
magnitude: 5.10001 debye
