program: Orca
programVersion: 4.2.1
elementType: Cl F O N N N C C C C C C C C C C C C C C C C C H H H H H H H H H H H H H
charge: 0
multiplicity: 1
keywords: wb97x-d3
keywords: def2-TZVPP
keywords: def2/J RIJCOSX GRIDX6 NOFINALGRIDX
keywords: grid4 nofinalgrid
keywords: scfconv7
keywords: smallprint printgap noloewdin
keywords: NOSOSCF
formula: C17H13ClFN3O
InChI: InChI=1S/C17H13ClFN3O/c18-15-4-2-1-3-14(15)16-17(23-16,9-22-11-20-10-21-22)12-5-7-13(19)8-6-12/h1-8,10-11,16H,9H2
36 atoms
Cl -0.683298 -0.443739 2.559896
F  6.180753 0.370135 0.51225
O  0.169266 1.385931 -1.251683
N  -1.087001 -1.196065 -1.589525
N  -1.990877 -1.857292 -0.859268
N  -2.948102 -0.983661 -2.689158
C  0.703948 0.24997 -0.613245
C  -0.186691 1.170675 0.101547
C  0.282126 -1.099293 -1.172355
C  2.166042 0.301091 -0.308337
C  -1.612875 0.910599 0.422212
C  2.696409 -0.50924 0.691123
C  3.014178 1.139856 -1.020187
C  -1.949685 0.204669 1.570196
C  -2.638778 1.4133 -0.36612
C  4.051814 -0.492377 0.974468
C  4.373543 1.168203 -0.747579
C  -1.676785 -0.680176 -2.678296
C  -3.266437 -0.007454 1.934091
C  -3.963919 1.201908 -0.020943
C  4.871678 0.347871 0.245055
C  -4.276706 0.496282 1.130145
C  -3.090078 -1.699473 -1.552433
H  0.309571 1.844937 0.801393
H  0.447147 -1.87642 -0.427888
H  0.930528 -1.324433 -2.02273
H  2.0449 -1.151556 1.270343
H  2.613339 1.78403 -1.79095
H  -2.395158 1.963808 -1.264594
H  4.467088 -1.116448 1.754046
H  5.038301 1.820138 -1.298035
H  -1.147665 -0.102429 -3.419785
H  -3.49727 -0.568496 2.828796
H  -4.750365 1.586037 -0.655689
H  -5.309549 0.329486 1.404969
H  -4.029132 -2.119855 -1.229852
totalener: -1455.20174495 hartree
nucrepener: 2061.86633537 hartree
electener: -3517.06808032 hartree
oneelecener: -6088.54515422 hartree
twoeener: 2571.47707390 hartree
kineticenergy: 1450.55383698 hartree
xcener: -115.884165746319 hartree
chargesum: -0.0000000
charge: -0.086674 -0.199856 -0.391498 0.112605 -0.289398 -0.325058 0.319074 0.085840 -0.089216 -0.017784 0.047679 -0.175274 -0.131620 0.023071 -0.144915 -0.199277 -0.187537 0.021767 -0.144494 -0.114813 0.284597 -0.128520 0.064569 0.125712 0.123649 0.129833 0.117717 0.134762 0.132079 0.127842 0.127722 0.143643 0.118048 0.128834 0.129029 0.127863
qa: -0.0867 -0.1999 -0.3915 0.1126 -0.2894 -0.3251 0.3191 0.0858 -0.0892 -0.0178 0.0477 -0.1753 -0.1316 0.0231 -0.1449 -0.1993 -0.1875 0.0218 -0.1445 -0.1148 0.2846 -0.1285 0.0646 0.1257 0.1236 0.1298 0.1177 0.1348 0.1321 0.1278 0.1277 0.1436 0.1180 0.1288 0.1290 0.1279
va: 1.2513 1.0895 2.0118 3.3410 2.8343 3.0362 3.6502 3.8752 3.7861 3.4780 3.5515 3.9688 3.9406 3.9455 3.8772 3.9821 3.9260 4.1045 4.0460 3.9369 3.9820 3.9329 4.0221 0.9984 1.0235 0.9996 1.0247 1.0218 1.0169 1.0072 1.0074 1.0092 1.0127 1.0026 0.9984 1.0048
dispcorr: -0.022190681 hartree
energy: -1455.223935632057
dipole: -9.79660 9.96922 0.17262 1.02875 -0.86765 0.16110 -7.37849 7.50185 0.12337
magnitude: 0.26641 au
magnitude: 0.67715 debye
