program: Orca
programVersion: 4.2.1
elementType: Cl F O N N N C C C C C C C C C C C C C C C C C H H H H H H H H H H H H H
charge: 0
multiplicity: 1
keywords: wb97x-d3
keywords: def2-TZVPP
keywords: def2/J RIJCOSX GRIDX6 NOFINALGRIDX
keywords: grid4 nofinalgrid
keywords: scfconv7
keywords: smallprint printgap noloewdin
keywords: NOSOSCF
formula: C17H13ClFN3O
InChI: InChI=1S/C17H13ClFN3O/c18-15-4-2-1-3-14(15)16-17(23-16,9-22-11-20-10-21-22)12-5-7-13(19)8-6-12/h1-8,10-11,16H,9H2
36 atoms
Cl 0.7318 -1.644453 2.087277
F  -4.568524 2.607627 0.562118
O  0.702237 0.077802 -1.910577
N  2.978304 1.180482 -0.322484
N  3.685422 0.961456 -1.433784
N  4.753582 0.127574 0.356857
C  0.561239 0.772334 -0.688869
C  0.802326 -0.678736 -0.720088
C  1.660279 1.757803 -0.344446
C  -0.809545 1.272739 -0.375724
C  -0.297716 -1.622768 -0.407378
C  -1.181212 1.455444 0.952995
C  -1.726836 1.545474 -1.382198
C  -0.414759 -2.13714 0.878776
C  -1.238678 -2.004447 -1.355356
C  -2.449371 1.906543 1.279838
C  -3.000678 2.000554 -1.072675
C  3.620583 0.668519 0.728829
C  -1.428907 -3.011921 1.227914
C  -2.26158 -2.880224 -1.023818
C  -3.336924 2.171888 0.254736
C  -2.356222 -3.38382 0.26531
C  4.736637 0.334791 -0.973216
H  1.80216 -1.054488 -0.507929
H  1.470865 2.182847 0.640205
H  1.64754 2.583448 -1.055937
H  -0.484729 1.232185 1.751936
H  -1.460112 1.402304 -2.420466
H  -1.170887 -1.612702 -2.361134
H  -2.741686 2.042652 2.312394
H  -3.717404 2.214651 -1.854234
H  3.238231 0.73037 1.735467
H  -1.498877 -3.395139 2.236649
H  -2.98556 -3.167897 -1.773908
H  -3.153076 -4.065424 0.53007
H  5.533802 0.018245 -1.627038
elementType: Cl F O N C H
totalener: -1455.22252098 hartree
nucrepener: 2046.26016537 hartree
electener: -3501.48268635 hartree
oneelecener: -6057.27361799 hartree
twoeener: 2555.79093164 hartree
cpcmener: -0.03237038 hartree
kineticenergy: 1450.56874050 hartree
xcener: -115.885049315144 hartree
chargesum: -0.0000000
charge: -0.095719 -0.224198 -0.428622 0.096856 -0.344490 -0.405525 0.286025 0.075968 -0.057712 0.129334 0.144026 -0.263796 -0.209870 -0.066371 -0.169358 -0.199227 -0.188162 0.054164 -0.161530 -0.161168 0.288327 -0.154226 0.068592 0.156621 0.136365 0.134406 0.142229 0.147677 0.149152 0.156338 0.154926 0.172382 0.144965 0.163489 0.165001 0.163132
qa: -0.0957 -0.2242 -0.4286 0.0969 -0.3445 -0.4055 0.2860 0.0760 -0.0577 0.1293 0.1440 -0.2638 -0.2099 -0.0664 -0.1694 -0.1992 -0.1882 0.0542 -0.1615 -0.1612 0.2883 -0.1542 0.0686 0.1566 0.1364 0.1344 0.1422 0.1477 0.1492 0.1563 0.1549 0.1724 0.1450 0.1635 0.1650 0.1631
va: 1.2371 1.0536 1.9818 3.3693 2.8860 3.0283 3.6319 3.8146 3.8611 3.4118 3.4095 3.9565 3.9284 3.9574 3.8890 3.9223 3.8847 4.0559 3.9877 3.9193 3.9197 3.9133 4.0412 0.9795 1.0008 1.0130 1.0126 1.0153 1.0126 0.9958 0.9967 0.9977 1.0046 0.9892 0.9862 0.9955
dispcorr: -0.020531137 hartree
energy: -1455.243052113064
dipole: 0.10622 -1.67654 -1.57032 -1.07030 1.23063 0.16034 -5.57415 6.30997 0.73582
magnitude: 1.74156 au
magnitude: 4.42670 debye
