program: Orca
programVersion: 4.2.1
elementType: Cl F O N N N C C C C C C C C C C C C C C C C C H H H H H H H H H H H H H
charge: 0
multiplicity: 1
keywords: wb97x-d3
keywords: def2-TZVPP
keywords: def2/J RIJCOSX GRIDX6 NOFINALGRIDX
keywords: grid4 nofinalgrid
keywords: scfconv7
keywords: smallprint printgap noloewdin
keywords: NOSOSCF
formula: C17H13ClFN3O
InChI: InChI=1S/C17H13ClFN3O/c18-15-4-2-1-3-14(15)16-17(23-16,9-22-11-20-10-21-22)12-5-7-13(19)8-6-12/h1-8,10-11,16H,9H2
36 atoms
Cl 0.629197 -1.729961 2.225254
F  -4.534515 2.710476 0.534578
O  0.719318 -0.005123 -1.785458
N  2.992112 1.175589 -0.410329
N  3.573138 1.17473 -1.611195
N  4.947271 0.299109 -0.075393
C  0.561339 0.698897 -0.576333
C  0.789035 -0.753449 -0.587899
C  1.659469 1.68115 -0.216876
C  -0.805995 1.226269 -0.293676
C  -0.327562 -1.687622 -0.299613
C  -1.668975 1.568864 -1.326921
C  -1.222001 1.389396 1.02394
C  -0.486889 -2.204372 0.981223
C  -1.244424 -2.060024 -1.275065
C  -2.932583 2.072411 -1.054413
C  -2.480751 1.890411 1.313841
C  3.822065 0.648968 0.495708
C  -1.520128 -3.06945 1.298236
C  -2.28556 -2.925379 -0.975549
C  -3.313724 2.224455 0.263535
C  -2.423434 -3.429678 0.309191
C  4.74115 0.642431 -1.362819
H  1.781671 -1.133966 -0.35122
H  1.555898 1.970856 0.828464
H  1.545841 2.58649 -0.8141
H  -1.365347 1.443394 -2.357856
H  -0.569185 1.112326 1.842666
H  -1.14209 -1.668395 -2.278192
H  -3.607319 2.340601 -1.856795
H  -2.807968 2.012643 2.337915
H  3.568274 0.553075 1.540071
H  -1.623427 -3.454025 2.303899
H  -2.990024 -3.204884 -1.747511
H  -3.23504 -4.103431 0.549576
H  5.478029 0.500532 -2.137987
elementType: Cl F O N C H
totalener: -1455.23084135 hartree
nucrepener: 2032.87134773 hartree
electener: -3488.10218908 hartree
oneelecener: -6030.45007986 hartree
twoeener: 2542.34789078 hartree
cpcmener: -0.02826379 hartree
kineticenergy: 1450.54474190 hartree
xcener: -115.880060402846 hartree
chargesum: -0.0000000
charge: -0.094877 -0.221839 -0.413744 0.095985 -0.337146 -0.405630 0.292892 0.067142 -0.059780 0.102262 0.138758 -0.197722 -0.255302 -0.059892 -0.163110 -0.194114 -0.204509 0.053774 -0.157970 -0.159092 0.292446 -0.150107 0.067765 0.161940 0.133315 0.130290 0.146301 0.140407 0.147311 0.152342 0.153114 0.173422 0.142373 0.160136 0.161339 0.161516
qa: -0.0949 -0.2218 -0.4137 0.0960 -0.3371 -0.4056 0.2929 0.0671 -0.0598 0.1023 0.1388 -0.1977 -0.2553 -0.0599 -0.1631 -0.1941 -0.2045 0.0538 -0.1580 -0.1591 0.2924 -0.1501 0.0678 0.1619 0.1333 0.1303 0.1463 0.1404 0.1473 0.1523 0.1531 0.1734 0.1424 0.1601 0.1613 0.1615
va: 1.2362 1.0573 1.9962 3.3858 2.8884 3.0348 3.6466 3.8300 3.8460 3.4253 3.4112 3.9305 3.9558 3.9610 3.8936 3.8952 3.9363 4.0532 3.9914 3.9250 3.9211 3.9181 4.0427 0.9796 1.0004 1.0131 1.0162 1.0144 1.0135 0.9978 0.9974 0.9962 1.0057 0.9904 0.9876 0.9950
dispcorr: -0.020087732 hartree
energy: -1455.250929079489
dipole: 0.36038 -1.84945 -1.48907 -1.18747 1.14151 -0.04596 -5.57478 6.45265 0.87787
magnitude: 1.72919 au
magnitude: 4.39524 debye
