program: Orca
programVersion: 4.2.1
elementType: Cl F O N N N C C C C C C C C C C C C C C C C C H H H H H H H H H H H H H
charge: 0
multiplicity: 1
keywords: wb97x-d3
keywords: def2-TZVPP
keywords: def2/J RIJCOSX GRIDX6 NOFINALGRIDX
keywords: grid4 nofinalgrid
keywords: scfconv7
keywords: smallprint printgap noloewdin
keywords: NOSOSCF
formula: C17H13ClFN3O
InChI: InChI=1S/C17H13ClFN3O/c18-15-4-2-1-3-14(15)16-17(23-16,9-22-11-20-10-21-22)12-5-7-13(19)8-6-12/h1-8,10-11,16H,9H2
36 atoms
Cl 0.480116 -1.628292 2.302682
F  -4.532935 2.774239 0.242605
O  0.827066 -0.003716 -1.731782
N  3.022427 1.166021 -0.311146
N  3.661734 0.613617 0.726354
N  4.895773 0.440657 -1.138378
C  0.602049 0.717228 -0.542586
C  0.83724 -0.731192 -0.518271
C  1.697242 1.700075 -0.170552
C  -0.773987 1.254615 -0.342466
C  -0.286566 -1.67148 -0.282778
C  -1.268663 1.433048 0.945068
C  -1.570527 1.595187 -1.427927
C  -0.527649 -2.158212 0.996579
C  -1.119299 -2.088143 -1.312909
C  -2.538211 1.94645 1.151679
C  -2.842687 2.111697 -1.237858
C  3.770466 1.044484 -1.418028
C  -1.562154 -3.040542 1.255359
C  -2.158838 -2.971328 -1.069951
C  -3.3059 2.280315 0.052084
C  -2.378957 -3.448503 0.212771
C  4.779396 0.196532 0.18412
H  1.816814 -1.090206 -0.206358
H  1.575992 2.023014 0.862499
H  1.602049 2.58635 -0.802587
H  -0.66892 1.1465 1.800341
H  -1.202777 1.447054 -2.434481
H  -0.947067 -1.712084 -2.312003
H  -2.931868 2.077513 2.150398
H  -3.468729 2.375946 -2.079334
H  3.457303 1.405845 -2.38493
H  -1.727327 -3.399461 2.261653
H  -2.797199 -3.287332 -1.883707
H  -3.189309 -4.137495 0.408723
H  5.541974 -0.298808 0.764298
totalener: -1455.20638133 hartree
nucrepener: 2035.52790876 hartree
electener: -3490.73429009 hartree
oneelecener: -6035.64859309 hartree
twoeener: 2544.91430300 hartree
kineticenergy: 1450.54591396 hartree
xcener: -115.878630819133 hartree
chargesum: 0.0000000
charge: -0.071010 -0.200390 -0.394318 0.078218 -0.318858 -0.329738 0.243060 0.130209 -0.078450 0.087611 0.093778 -0.234295 -0.175455 -0.058908 -0.138212 -0.178886 -0.170273 0.069414 -0.147411 -0.129457 0.275222 -0.111130 0.065309 0.145968 0.123337 0.121516 0.130807 0.131724 0.131991 0.128637 0.127272 0.139841 0.121038 0.129525 0.129524 0.132790
qa: -0.0710 -0.2004 -0.3943 0.0782 -0.3189 -0.3297 0.2431 0.1302 -0.0785 0.0876 0.0938 -0.2343 -0.1755 -0.0589 -0.1382 -0.1789 -0.1703 0.0694 -0.1474 -0.1295 0.2752 -0.1111 0.0653 0.1460 0.1233 0.1215 0.1308 0.1317 0.1320 0.1286 0.1273 0.1398 0.1210 0.1295 0.1295 0.1328
va: 1.2642 1.0894 2.0130 3.3449 2.8298 3.0666 3.7273 3.7606 3.8245 3.4774 3.5303 3.9717 3.9516 4.0350 3.9308 3.9608 3.9154 4.0682 4.0359 3.9757 3.9968 3.9612 4.0413 0.9970 1.0184 1.0023 1.0218 1.0199 1.0183 1.0058 1.0061 1.0082 1.0139 1.0006 0.9982 1.0013
dispcorr: -0.020057685 hartree
energy: -1455.226439014508
dipole: 0.88879 -2.06520 -1.17642 -1.27828 1.35202 0.07374 -7.02791 6.89235 -0.13557
magnitude: 1.18650 au
magnitude: 3.01584 debye
