program: Orca
programVersion: 4.2.1
elementType: Cl F O N N N C C C C C C C C C C C C C C C C C H H H H H H H H H H H H H
charge: 0
multiplicity: 1
keywords: wb97x-d3
keywords: def2-TZVPP
keywords: def2/J RIJCOSX GRIDX6 NOFINALGRIDX
keywords: grid4 nofinalgrid
keywords: scfconv7
keywords: smallprint printgap noloewdin
keywords: NOSOSCF
formula: C17H13ClFN3O
InChI: InChI=1S/C17H13ClFN3O/c18-15-4-2-1-3-14(15)16-17(23-16,9-22-11-20-10-21-22)12-5-7-13(19)8-6-12/h1-8,10-11,16H,9H2
36 atoms
Cl 1.287607 -2.610646 0.997393
F  -3.087546 3.213253 1.682966
O  0.023409 -0.340621 -2.569424
N  2.518112 1.335156 -0.423319
N  2.451212 2.578888 0.058299
N  3.540194 1.242355 1.491717
C  0.526581 0.291632 -1.412367
C  0.435675 -1.174459 -1.510344
C  1.862844 0.972269 -1.651431
C  -0.453978 1.048519 -0.585012
C  -0.62267 -1.929564 -0.794458
C  -0.400889 0.987788 0.8026
C  -1.412748 1.84733 -1.194012
C  -0.328774 -2.636219 0.365636
C  -1.933198 -1.948844 -1.256938
C  -1.287089 1.717633 1.576445
C  -2.307886 2.582974 -0.433987
C  3.167278 0.548207 0.448431
C  -1.297914 -3.345864 1.053423
C  -2.91458 -2.653926 -0.580561
C  -2.227239 2.506808 0.942735
C  -2.597516 -3.353408 0.573476
C  3.076759 2.477848 1.204808
H  1.354699 -1.729607 -1.701216
H  1.711029 1.890515 -2.218386
H  2.517276 0.323114 -2.237064
H  0.330331 0.357824 1.294161
H  -1.471353 1.894855 -2.273802
H  -2.180224 -1.40012 -2.154995
H  -1.251525 1.672138 2.656248
H  -3.057315 3.206931 -0.901636
H  3.342695 -0.502796 0.279054
H  -1.037291 -3.880971 1.955915
H  -3.92891 -2.655583 -0.955518
H  -3.359912 -3.904521 1.107159
H  3.209598 3.326718 1.856594
totalener: -1455.20359220 hartree
nucrepener: 2069.14700219 hartree
electener: -3524.35059439 hartree
oneelecener: -6102.81805668 hartree
twoeener: 2578.46746228 hartree
kineticenergy: 1450.54569023 hartree
xcener: -115.877578067728 hartree
chargesum: -0.0000000
charge: -0.085381 -0.201758 -0.368489 0.104090 -0.295628 -0.321657 0.217911 0.087361 -0.083095 0.136920 0.082835 -0.223298 -0.163001 -0.048740 -0.111432 -0.179663 -0.177527 0.023569 -0.134282 -0.126345 0.277368 -0.118599 0.062423 0.118738 0.116737 0.121468 0.128113 0.126105 0.131786 0.125631 0.125433 0.134480 0.124632 0.130705 0.130678 0.131910
qa: -0.0854 -0.2018 -0.3685 0.1041 -0.2956 -0.3217 0.2179 0.0874 -0.0831 0.1369 0.0828 -0.2233 -0.1630 -0.0487 -0.1114 -0.1797 -0.1775 0.0236 -0.1343 -0.1263 0.2774 -0.1186 0.0624 0.1187 0.1167 0.1215 0.1281 0.1261 0.1318 0.1256 0.1254 0.1345 0.1246 0.1307 0.1307 0.1319
va: 1.2503 1.0881 2.0408 3.3095 2.8592 3.0575 3.7119 3.8564 3.8388 3.3493 3.4487 3.9438 3.9616 4.0160 3.9391 3.9746 3.9181 4.0798 4.0190 3.9728 3.9908 3.9684 4.0406 0.9999 1.0200 1.0005 1.0064 1.0148 1.0205 1.0053 1.0065 1.0137 1.0092 1.0002 0.9982 1.0024
dispcorr: -0.021500223 hartree
energy: -1455.225092427437
dipole: -2.34545 1.71290 -0.63255 -1.03934 0.09303 -0.94631 -6.29880 5.57646 -0.72234
magnitude: 1.34811 au
magnitude: 3.42662 debye
