program: Orca
programVersion: 4.2.1
elementType: Cl Cl O N N N C C C C C C C C C C C C C C C H H H H H H H H H H H H H H H H H
charge: 0
multiplicity: 1
keywords: wb97x-d3
keywords: def2-TZVPP
keywords: def2/J RIJCOSX GRIDX6 NOFINALGRIDX
keywords: grid4 nofinalgrid
keywords: scfconv7
keywords: smallprint printgap noloewdin
keywords: NOSOSCF
formula: C15H17Cl2N3O
InChI: InChI=1S/C15H17Cl2N3O/c1-15(2,3)14(21)13(20-9-18-8-19-20)6-10-4-5-11(16)7-12(10)17/h4-9,14,21H,1-3H3
38 atoms
Cl 1.330501 -1.749304 2.343746
Cl 5.519069 0.428819 -0.190933
O  -1.761581 1.661022 1.299627
N  -2.608616 -0.844886 -0.056017
N  -3.546939 -0.444001 0.812153
N  -4.320341 -2.12158 -0.442504
C  -1.897696 2.06752 -1.130918
C  -1.272041 1.260893 0.039999
C  -1.568714 3.543715 -0.884018
C  -3.416798 1.929765 -1.251773
C  -1.253403 1.642701 -2.449097
C  -1.322178 -0.249591 -0.073622
C  -0.275318 -1.074621 -0.086328
C  1.140081 -0.674944 -0.126703
C  -3.090004 -1.850425 -0.799721
C  1.980613 -0.96399 0.948288
C  1.709866 -0.054707 -1.234764
C  -4.553104 -1.236001 0.54539
C  3.32416 -0.630878 0.943968
C  3.04994 0.293353 -1.268363
C  3.844622 0.003009 -0.172558
H  -0.208987 1.519774 0.04406
H  -1.902973 4.15362 -1.725378
H  -2.055692 3.92776 0.012474
H  -0.493523 3.704258 -0.773462
H  -3.782004 2.63814 -1.998358
H  -3.935522 2.160315 -0.320647
H  -3.734259 0.941912 -1.586269
H  -1.412467 0.586001 -2.675129
H  -0.178486 1.831086 -2.450337
H  -1.67583 2.214156 -3.27752
H  -0.459873 -2.14295 -0.022803
H  -2.631757 1.258172 1.435507
H  -2.522153 -2.326599 -1.583224
H  1.09582 0.144251 -2.101335
H  -5.485531 -1.172601 1.083486
H  3.94969 -0.858693 1.795782
H  3.463137 0.777544 -2.14216
elementType: Cl O N C H
totalener: -1741.79914145 hartree
nucrepener: 1963.52853634 hartree
electener: -3705.32767780 hartree
oneelecener: -6288.89759303 hartree
twoeener: 2583.56991524 hartree
cpcmener: -0.02301126 hartree
kineticenergy: 1736.89774555 hartree
xcener: -122.678237693985 hartree
chargesum: 0.0000000
charge: -0.068150 -0.082112 -0.433314 0.146607 -0.364277 -0.396000 0.278603 0.154522 -0.342694 -0.355138 -0.404675 -0.080733 -0.066889 0.000123 0.069656 0.070578 -0.208249 0.091252 -0.179972 -0.157000 0.119001 0.111198 0.095398 0.097983 0.096134 0.102297 0.095524 0.096874 0.105915 0.100887 0.109062 0.158520 0.228411 0.183031 0.189802 0.166288 0.126279 0.145257
qa: -0.0682 -0.0821 -0.4333 0.1466 -0.3643 -0.3960 0.2786 0.1545 -0.3427 -0.3551 -0.4047 -0.0807 -0.0669 0.0001 0.0697 0.0706 -0.2082 0.0913 -0.1800 -0.1570 0.1190 0.1112 0.0954 0.0980 0.0961 0.1023 0.0955 0.0969 0.1059 0.1009 0.1091 0.1585 0.2284 0.1830 0.1898 0.1663 0.1263 0.1453
va: 1.2585 1.2215 1.9906 3.3684 2.8436 3.0425 3.6408 3.9759 3.9243 3.9538 3.9536 3.8634 3.8263 3.6178 4.0469 3.9502 3.9370 4.0058 4.0949 4.0266 3.8585 1.0058 1.0062 1.0191 1.0020 1.0088 1.0159 0.9978 0.9962 1.0009 1.0100 1.0016 1.0523 0.9895 0.9746 0.9924 1.0228 1.0073
dispcorr: -0.022280887 hartree
energy: -1741.821422339403
dipole: -29.99264 30.42049 0.42785 19.95337 -20.03980 -0.08643 -18.18841 16.57757 -1.61084
magnitude: 1.66893 au
magnitude: 4.24208 debye
