program: Orca
programVersion: 4.2.1
elementType: Cl Cl O N N N C C C C C C C C C C C C C C C H H H H H H H H H H H H H H H H H
charge: 0
multiplicity: 1
keywords: wb97x-d3
keywords: def2-TZVPP
keywords: def2/J RIJCOSX GRIDX6 NOFINALGRIDX
keywords: grid4 nofinalgrid
keywords: scfconv7
keywords: smallprint printgap noloewdin
keywords: NOSOSCF
formula: C15H17Cl2N3O
InChI: InChI=1S/C15H17Cl2N3O/c1-15(2,3)14(21)13(20-9-18-8-19-20)6-10-4-5-11(16)7-12(10)17/h4-9,14,21H,1-3H3
38 atoms
Cl 1.443064 -2.289108 1.987339
Cl 5.556843 0.449901 -0.060221
O  -1.825287 1.744123 1.367761
N  -2.603902 -0.756988 -0.052757
N  -3.541016 -0.429424 0.847142
N  -4.29512 -2.037116 -0.507722
C  -2.016383 2.173502 -1.056038
C  -1.336074 1.380207 0.096545
C  -1.670201 3.650935 -0.846145
C  -3.541201 2.041442 -1.09395
C  -1.454891 1.7305 -2.406191
C  -1.331626 -0.127943 -0.044358
C  -0.26914 -0.936499 -0.06626
C  1.147027 -0.554283 -0.072088
C  -3.072747 -1.719932 -0.856792
C  2.033628 -1.149415 0.829414
C  1.687353 0.352359 -0.981368
C  -4.533892 -1.223017 0.538302
C  3.384789 -0.850112 0.845511
C  3.032951 0.677155 -0.985853
C  3.871691 0.070358 -0.067441
H  -0.285757 1.683744 0.093663
H  -2.068421 4.255412 -1.663789
H  -2.086491 4.042093 0.082222
H  -0.589514 3.810671 -0.820483
H  -3.942104 2.761358 -1.810706
H  -4.010063 2.262405 -0.13481
H  -3.88133 1.060375 -1.425199
H  -0.389814 1.950129 -2.499781
H  -1.955749 2.267873 -3.214062
H  -1.597396 0.664656 -2.595909
H  -0.45678 -2.004956 -0.03418
H  -2.675442 1.302792 1.509635
H  -2.4994 -2.134796 -1.670847
H  1.048499 0.796599 -1.72984
H  -5.463101 -1.210119 1.085792
H  4.042041 -1.323198 1.561145
H  3.416695 1.382404 -1.709286
elementType: Cl O N C H
totalener: -1741.79892331 hartree
nucrepener: 1955.28499689 hartree
electener: -3697.08392020 hartree
oneelecener: -6272.27068893 hartree
twoeener: 2575.18676874 hartree
cpcmener: -0.02286273 hartree
kineticenergy: 1736.89448003 hartree
xcener: -122.678720166810 hartree
chargesum: -0.0000000
charge: -0.068893 -0.080746 -0.434331 0.146322 -0.365256 -0.395345 0.281088 0.134098 -0.342168 -0.355326 -0.401815 -0.091048 -0.059385 0.015751 0.064322 0.066777 -0.213582 0.090717 -0.179175 -0.177261 0.130718 0.117896 0.095543 0.098710 0.095354 0.101959 0.096026 0.096170 0.098949 0.111777 0.110534 0.145701 0.229440 0.186848 0.213659 0.165578 0.125889 0.144505
qa: -0.0689 -0.0807 -0.4343 0.1463 -0.3653 -0.3953 0.2811 0.1341 -0.3422 -0.3553 -0.4018 -0.0910 -0.0594 0.0158 0.0643 0.0668 -0.2136 0.0907 -0.1792 -0.1773 0.1307 0.1179 0.0955 0.0987 0.0954 0.1020 0.0960 0.0962 0.0989 0.1118 0.1105 0.1457 0.2294 0.1868 0.2137 0.1656 0.1259 0.1445
va: 1.2591 1.2232 1.9901 3.3665 2.8362 3.0416 3.6305 3.9805 3.9215 3.9522 3.9473 3.8496 3.8551 3.5706 4.0461 3.9562 3.8891 4.0064 4.0965 4.0630 3.8610 1.0038 1.0060 1.0187 1.0026 1.0085 1.0167 0.9981 1.0065 1.0060 0.9974 1.0137 1.0501 0.9881 0.9609 0.9928 1.0230 1.0090
dispcorr: -0.022011559 hartree
energy: -1741.820934864665
dipole: -31.43907 31.87453 0.43546 22.48530 -22.33429 0.15100 -16.82137 15.28776 -1.53361
magnitude: 1.60137 au
magnitude: 4.07036 debye
