program: Orca
programVersion: 4.2.1
elementType: Cl Cl O O O N N N C C C C C C C C C C C C C C C C C C C H H H H H H H H H H H H H H H H H
charge: 0
multiplicity: 1
keywords: wb97x-d3
keywords: def2-TZVPP
keywords: def2/J RIJCOSX GRIDX6 NOFINALGRIDX
keywords: grid4 nofinalgrid
keywords: scfconv7
keywords: smallprint printgap noloewdin
keywords: NOSOSCF
formula: C19H17Cl2N3O3
InChI: InChI=1S/C19H17Cl2N3O3/c1-13-9-25-19(27-13,10-24-12-22-11-23-24)17-7-6-16(8-18(17)21)26-15-4-2-14(20)3-5-15/h2-8,11-13H,9-10H2,1H3
44 atoms
Cl 0.06694 -1.927984 0.211759
Cl -7.481431 0.167334 -1.822185
O  2.728034 -0.96815 -0.634339
O  3.561659 0.923163 0.219689
O  -2.554569 2.40606 0.418391
N  4.034557 -1.524507 1.760079
N  5.240513 -1.029175 2.051797
N  5.405886 -3.171952 1.402532
C  2.581665 -0.051378 0.41406
C  3.566094 -0.4126 -1.650721
C  2.839464 -0.726491 1.766883
C  3.751763 1.025997 -1.181259
C  1.182664 0.560652 0.406169
C  4.862436 -1.185538 -1.762708
C  0.018125 -0.197114 0.306532
C  1.023817 1.93888 0.527591
C  -1.243439 0.378035 0.305111
C  -0.219188 2.543056 0.509944
C  -1.356254 1.757915 0.390597
C  4.153448 -2.790742 1.358893
C  6.023476 -2.051968 1.825127
C  -3.677267 1.828483 -0.122332
C  -3.686382 1.319527 -1.414207
C  -4.830882 1.833554 0.645121
C  -4.860281 0.800955 -1.93559
C  -6.009794 1.328655 0.118764
C  -6.013736 0.809747 -1.165737
H  3.027371 -0.449045 -2.600262
H  2.006813 -1.372161 2.037836
H  2.921693 0.031458 2.543864
H  4.749504 1.419669 -1.370311
H  3.018427 1.701407 -1.634205
H  5.486061 -1.060857 -0.875999
H  4.677711 -2.249584 -1.909579
H  5.430049 -0.826464 -2.622147
H  1.898169 2.566311 0.629888
H  -2.118292 -0.254887 0.243246
H  -0.306923 3.618099 0.592198
H  3.30929 -3.397046 1.07142
H  7.088951 -1.991701 1.98284
H  -2.791112 1.325679 -2.022403
H  -4.814677 2.237329 1.648807
H  -4.870401 0.401384 -2.940064
H  -6.911803 1.336217 0.714667
elementType: Cl O N C H
totalener: -2044.68900045 hartree
nucrepener: 2716.94602431 hartree
electener: -4761.63502476 hartree
oneelecener: -8204.34382579 hartree
twoeener: 3442.70880103 hartree
cpcmener: -0.03338286 hartree
kineticenergy: 2038.70142935 hartree
xcener: -149.989157937643 hartree
chargesum: 0.0000000
charge: -0.080694 -0.099678 -0.377811 -0.377141 -0.327528 0.142493 -0.358507 -0.408834 0.594847 0.179395 -0.161346 -0.027108 -0.121107 -0.297249 -0.044956 -0.103906 -0.179221 -0.269543 0.298760 0.068465 0.050959 0.289126 -0.208246 -0.248336 -0.121796 -0.108109 0.065126 0.079167 0.153355 0.132504 0.108880 0.101911 0.080339 0.094332 0.111903 0.154294 0.132596 0.149605 0.160426 0.160144 0.162400 0.152853 0.148809 0.148423
qa: -0.0807 -0.0997 -0.3778 -0.3771 -0.3275 0.1425 -0.3585 -0.4088 0.5948 0.1794 -0.1613 -0.0271 -0.1211 -0.2972 -0.0450 -0.1039 -0.1792 -0.2695 0.2988 0.0685 0.0510 0.2891 -0.2082 -0.2483 -0.1218 -0.1081 0.0651 0.0792 0.1534 0.1325 0.1089 0.1019 0.0803 0.0943 0.1119 0.1543 0.1326 0.1496 0.1604 0.1601 0.1624 0.1529 0.1488 0.1484
va: 1.2423 1.2039 2.0042 2.0013 2.0840 3.3307 2.8797 3.0192 3.8370 3.8827 3.7941 3.9626 3.6188 3.9332 4.0583 3.8764 3.9692 4.0617 3.7711 4.0700 4.0492 3.6743 3.9739 4.0513 3.9537 3.9437 3.8405 0.9999 1.0104 1.0255 0.9993 0.9963 1.0058 1.0089 1.0076 1.0171 1.0242 1.0086 1.0069 0.9982 0.9925 1.0045 1.0025 1.0011
dispcorr: -0.025036651 hartree
energy: -2044.714037097901
dipole: 30.48344 -31.42204 -0.93859 5.12195 -3.64970 1.47225 -2.15774 1.31056 -0.84718
magnitude: 1.94067 au
magnitude: 4.93279 debye
