program: Orca
programVersion: 4.2.1
elementType: Cl Cl O O O N N N C C C C C C C C C C C C C C C C C C C H H H H H H H H H H H H H H H H H
charge: 0
multiplicity: 1
keywords: wb97x-d3
keywords: def2-TZVPP
keywords: def2/J RIJCOSX GRIDX6 NOFINALGRIDX
keywords: grid4 nofinalgrid
keywords: scfconv7
keywords: smallprint printgap noloewdin
keywords: NOSOSCF
formula: C19H17Cl2N3O3
InChI: InChI=1S/C19H17Cl2N3O3/c1-13-9-25-19(27-13,10-24-12-22-11-23-24)17-7-6-16(8-18(17)21)26-15-4-2-14(20)3-5-15/h2-8,11-13H,9-10H2,1H3
44 atoms
Cl 2.555633 0.560909 -2.727345
Cl -7.003757 1.370007 1.618578
O  3.910769 1.023933 -0.135266
O  3.133074 0.088638 1.720406
O  -2.263014 0.068676 -1.568724
N  2.90519 -2.457379 0.250517
N  2.072524 -2.995305 -0.646648
N  1.708186 -3.871743 1.386903
C  3.105064 -0.014542 0.322167
C  3.659667 2.137389 0.71695
C  3.753476 -1.34243 -0.08204
C  3.243526 1.46998 2.038829
C  1.668634 0.078665 -0.186269
C  4.89491 2.997885 0.813606
C  1.338712 0.308764 -1.519691
C  0.61295 -0.166498 0.686727
C  0.025624 0.33184 -1.957558
C  -0.708602 -0.170691 0.275771
C  -0.998667 0.088821 -1.054871
C  2.665922 -2.980148 1.45546
C  1.383821 -3.835079 0.079804
C  -3.337324 0.381128 -0.773402
C  -4.452583 -0.438373 -0.855544
C  -3.346053 1.509413 0.035996
C  -5.589617 -0.130007 -0.124462
C  -4.476381 1.810252 0.777992
C  -5.590489 0.98875 0.692668
H  2.828921 2.726895 0.313786
H  4.711784 -1.450185 0.4258
H  3.935348 -1.368479 -1.153711
H  3.997396 1.583109 2.820181
H  2.29706 1.868222 2.41207
H  5.738419 2.435938 1.216962
H  5.175519 3.401166 -0.159394
H  4.703476 3.841835 1.476197
H  0.822333 -0.374496 1.726425
H  -0.204925 0.525001 -2.996756
H  -1.488123 -0.384105 0.994467
H  3.217217 -2.702329 2.339254
H  0.614999 -4.455003 -0.354068
H  -4.440548 -1.312352 -1.49351
H  -2.483291 2.160267 0.096184
H  -6.46169 -0.765844 -0.193016
H  -4.483187 2.686382 1.411437
elementType: Cl O N C H
totalener: -2044.68806387 hartree
nucrepener: 2762.32504201 hartree
electener: -4807.01310588 hartree
oneelecener: -8295.68088488 hartree
twoeener: 3488.66777900 hartree
cpcmener: -0.03326894 hartree
kineticenergy: 2038.69556084 hartree
xcener: -149.986973376390 hartree
chargesum: 0.0000000
charge: -0.081036 -0.100706 -0.375888 -0.401259 -0.331312 0.106376 -0.335833 -0.408964 0.598142 0.142996 -0.080477 0.005231 -0.179581 -0.289064 0.041556 -0.122303 -0.234547 -0.241275 0.298128 0.061659 0.056733 0.296875 -0.253552 -0.205362 -0.107533 -0.124281 0.064349 0.083928 0.131678 0.129236 0.098139 0.094241 0.086138 0.096878 0.100242 0.154177 0.127374 0.156477 0.170357 0.162223 0.152906 0.160182 0.147805 0.148945
qa: -0.0810 -0.1007 -0.3759 -0.4013 -0.3313 0.1064 -0.3358 -0.4090 0.5981 0.1430 -0.0805 0.0052 -0.1796 -0.2891 0.0416 -0.1223 -0.2345 -0.2413 0.2981 0.0617 0.0567 0.2969 -0.2536 -0.2054 -0.1075 -0.1243 0.0643 0.0839 0.1317 0.1292 0.0981 0.0942 0.0861 0.0969 0.1002 0.1542 0.1274 0.1565 0.1704 0.1622 0.1529 0.1602 0.1478 0.1489
va: 1.2394 1.2029 2.0073 1.9596 2.0775 3.3708 2.8851 3.0307 3.8307 3.8483 3.8145 3.9240 3.6259 3.9746 3.9426 3.8841 4.1417 4.0186 3.7580 4.0677 4.0459 3.6733 4.0463 3.9686 3.9428 3.9563 3.8381 1.0041 1.0218 1.0268 1.0011 0.9959 1.0065 1.0035 1.0019 1.0184 1.0282 0.9978 1.0067 0.9960 1.0044 0.9941 1.0011 1.0023
dispcorr: -0.025316862 hartree
energy: -2044.713380735294
dipole: 23.24299 -22.33983 0.90315 5.21877 -3.34140 1.87737 9.83018 -8.81282 1.01736
magnitude: 2.31845 au
magnitude: 5.89304 debye
