program: Gaussian 09
title: 000030181
version: EM64L-G09RevD.01
frameworkgroup: C1[X(C9H14O2)]
method: RPBEPBE
basis: SDD
operation: Freq
keyword: #pfreq=noraman
keyword: PBEPBE/SDD
title: #p freq=noraman PBEPBE/SDD
converged: YES YES NO NO
title: Mulliken charges:
elementType: O O C C C C C C C C C H H H H H H H H H H H H H H
charge: -0.179124 -0.180471 0.208136 -0.168431 -0.531164 0.115268 -0.508833 0.141712 -0.718377 -0.725268 -0.708935 0.251653 0.234743 0.250076 0.256172 0.226826 0.208121 0.226646 0.235597 0.229179 0.230532 0.228683 0.213019 0.223425 0.240814
chargesum: 0.00000
title: Mulliken charges with hydrogens summed into heavy atoms:
elementType: O O C C C C C C C C C
charge: -0.179124 -0.180471 0.208136 0.083222 -0.046345 0.115268 -0.025835 0.141712 -0.048014 -0.036874 -0.031676
polarizability: 1.02637717e+02 4.48968902e-01 1.07681304e+02 -5.46381043e-01 4.23511103e+00 8.01362570e+01
1716.lowfreq: -5.1677 -0.0005 -0.0004 0.0008 16.7899 30.5993 61.4020 82.0823 94.7759
frequency: 61.4004 81.8179 94.7109 183.1728 203.2767 209.8777 241.5743 270.6465 281.1068 309.8185 338.1831 344.4940 381.8585 404.0144 477.7816 485.5992 561.0759 572.8158 711.8282 732.0665 809.9938 844.8018 849.2707 904.5610 936.0021 944.4568 959.4771 987.0534 1013.3879 1034.1101 1092.3303 1121.0334 1128.9337 1153.1146 1187.7776 1207.4930 1233.7328 1252.2682 1265.0045 1275.3669 1303.6766 1332.8406 1381.0659 1393.4760 1399.2152 1435.8325 1446.2110 1461.6611 1465.1346 1467.7181 1472.8515 1478.6802 1486.0299 1617.8541 1637.3243 2962.7158 2970.6095 2978.8923 2980.6640 2989.7247 2992.7630 3065.0078 3074.7718 3077.8308 3082.8751 3087.3584 3088.6063 3096.6704 3099.8288
redmass: 7.3495 2.8224 4.0367 1.3604 1.5239 1.0583 1.3658 2.1811 2.3247 2.7316 4.2900 2.9336 3.1474 2.5320 3.5287 2.8669 3.7285 4.6914 3.3015 3.2016 2.1003 3.5554 2.1487 2.0650 1.9395 1.4240 1.5608 1.7472 1.4962 1.6121 1.4243 2.1586 2.7267 2.1621 2.0545 2.4407 1.9731 2.0957 1.4375 1.3362 1.7649 1.9383 1.1844 1.2047 1.1951 1.0902 1.0820 1.0505 1.0497 1.0464 1.0522 1.0517 1.0620 10.4835 9.4577 1.0772 1.0641 1.0653 1.0358 1.0361 1.0360 1.0979 1.0975 1.0997 1.1007 1.0998 1.1002 1.0992 1.0993
irintensity: 8.3619 1.6631 1.6103 0.3703 0.2934 0.0100 0.0490 0.1834 0.3001 0.1636 12.4296 0.8808 0.5885 1.5422 3.8890 5.7509 0.9986 0.1613 0.7559 1.5512 0.7922 7.7498 3.6888 10.9387 3.6308 1.6439 0.4555 25.0294 12.5238 1.3858 2.5912 3.7661 43.5359 18.7712 7.6539 7.5865 11.1511 40.4171 27.6737 10.0797 6.0642 2.0029 20.5740 16.8083 16.5194 17.0972 7.2536 4.4380 4.6765 16.6334 11.5102 10.9338 19.4660 127.1558 154.3601 3.8576 5.3011 24.2546 24.6306 26.0363 22.3343 11.9273 7.1457 18.2604 17.9240 34.0644 33.6913 24.9572 24.1713
temp: 298.150 k
press: 1.00000 atm
elementType: 8 8 6 6 6 6 6 6 6 6 6 1 1 1 1 1 1 1 1 1 1 1 1 1 1
symmnumber: 1
zpe: 553124.4 jmol-1
zpe.correction: 0.210674 hartree
zpe.thermalcorrener: 0.222524 hartree
zpe.thermalcorrenthalpy: 0.223468 hartree
zpe.thermalcorrgfe: 0.173566 hartree
zpe.sumelectzpe: -500.939950 hartree
zpe.sumelectthermal: -500.928100 hartree
zpe.sumelectthermalent: -500.927156 hartree
zpe.sumelectthermalfe: -500.977058 hartree
dipole: 0.1435 -0.5180 0.1975
dipole: 0.5726
quadrupole: -61.0894 -88.1571 -63.5876
quadrupole: 0.2547 0.1052 -4.1059
quadrupole: 9.8553 -17.2124 7.3571 0.2547 0.1052 -4.1059
hfenergy: -501.150624 hartree
pointgroup: C01 [X(C9H14O2)]
dipole: -0.2142732 -0.0045499 -0.0694432 debye
dipolederiv: -0.7720997 -0.1097502 0.1833493 -0.0998621 -0.5853045 0.0402921 0.2426116 0.0280978 -0.2942528 -0.8912542 -0.1127889 0.1148459 -0.1317872 -0.55327 0.011254 0.261639 0.0438237 -0.3200961 0.1247793 -0.1146753 0.0496911 -0.0782277 -0.2350675 0.0337681 0.0917539 0.0522145 0.0731842 -0.0977411 0.2065318 0.08747 0.1503639 -0.1161159 -0.0336491 0.1355469 -0.0522786 0.1322467 -0.2712863 0.2259464 0.0781664 0.19665 -0.1511989 -0.0705277 0.1275629 -0.0528012 0.0471181 0.7671848 0.0466205 -0.3147815 0.0349885 0.9197733 -0.0620805 -0.3915142 0.0015618 0.0821359 -0.022309 -0.1896271 0.0092051 -0.1575324 -0.3983436 0.0040148 0.0634532 -0.0035882 0.1194093 0.9493531 0.0352886 -0.2734655 0.050902 0.9686456 0.0028089 -0.454702 -0.0148819 0.1432335 -0.0382327 0.0462045 0.0259138 0.0492217 0.0160867 -0.022659 0.0029658 -0.0137381 0.0135343 0.0320948 -0.0083829 0.0375368 -0.008842 -0.0064118 0.0263192 -0.0085485 -0.0607235 -0.0183718 0.0069985 -0.0478047 -0.0159644 -0.0409732 -0.0376786 0.0143736 -0.0377568 -0.0097629 0.0730963 0.0447669 -0.0159434 0.0192252 0.0011539 0.0548548 0.0673688 -0.0065429 0.0592412 -0.0970658 0.0802302 0.004025 0.0265595 0.0271255 0.0866993 0.0532385 -0.0061696 0.0190991 -0.1011271 0.026257 -0.0550668 -0.0039257 -0.0372243 -0.1144718 0.0055814 0.0119611 0.0433485 0.0883541 -0.0506589 0.093202 0.0321554 0.0639836 -0.0087412 -0.0344191 0.0440605 -0.0622362 0.0635857 0.0911313 -0.010524 0.0440356 -0.0187163 0.0748806 0.020122 -0.0197392 0.0362739 -0.087651 0.0640799 -0.0931347 0.0098799 -0.0297824 -0.1546894 -0.0060957 0.0186265 0.0202269 0.0873066 0.0795622 0.0180445 0.0102739 -0.002661 0.0797844 0.0711192 0.0340735 0.025212 -0.1302715 -0.0941586 0.0287533 -0.0720955 -0.0266864 0.0963375 -0.0229628 -0.0976728 -0.0104683 0.0343581 0.0883068 -0.0471157 0.0048013 -0.0333032 -0.1454445 0.0499304 0.0037371 0.0078559 0.0677908 -0.0732241 -0.0252716 -0.1189628 -0.0521177 0.0974298 -0.0283717 -0.0771669 -0.0023924 0.0185045 -0.0429458 0.0944182 0.0849641 0.0959468 0.0295126 -0.0655779 0.0667863 -0.0515481 0.0226912 -0.0279934 0.1468471 0.0670822 0.0847315 -0.0446324 -0.0377991 0.0604624 -0.0516955 0.0676169 0.0916725 -0.0242694 0.0135746 -0.0036325 0.063446 -0.010233 0.0188392 0.06449 -0.1269952 -0.0645134 -0.0915271 -0.0995344 -0.0337189 0.0639194 -0.0058154 -0.084267 -0.0153307 0.0416652 unknown
polarizability: 106.654574|1.7072436|103.2901257|-5.2512103|-0.8588214|80.5105775 unknown
InChI: InChI=1S/C9H14O2/c1-6-4-7(10)5-9(2,3)8(6)11/h6H,4-5H2,1-3H3
charge 0 multiplicity 1
25 atoms
O  -2.189345 -0.778543 0.511808
O  2.89831 0.670222 -0.204912
C  -0.678111 1.081837 -0.033717
C  -0.011783 -1.446905 -0.379547
C  0.70422 1.303698 0.673305
C  -1.064177 -0.416999 0.078145
C  1.361602 -1.160383 0.311154
C  1.768822 0.308625 0.218494
C  -1.753371 1.966787 0.632578
C  -0.552323 1.453295 -1.543832
C  -0.473772 -2.896789 -0.148813
H  0.133353 -1.287775 -1.469412
H  0.564542 1.184981 1.768177
H  1.06247 2.331232 0.48606
H  2.154886 -1.787397 -0.130114
H  1.27257 -1.430442 1.384328
H  -1.453282 3.029639 0.584487
H  -1.901278 1.688674 1.690758
H  -2.726885 1.851915 0.126208
H  -0.354006 2.536577 -1.637781
H  -1.490859 1.230482 -2.082916
H  0.275201 0.920584 -2.045041
H  0.288088 -3.607835 -0.515965
H  -0.645368 -3.087806 0.92534
H  -1.424403 -3.096874 -0.670992
