program: Orca
programVersion: 4.2.1
elementType: Cl Cl O O O N N N C C C C C C C C C C C C C C C C C C C H H H H H H H H H H H H H H H H H
charge: 0
multiplicity: 1
keywords: wb97x-d3
keywords: def2-TZVPP
keywords: def2/J RIJCOSX GRIDX6 NOFINALGRIDX
keywords: grid4 nofinalgrid
keywords: scfconv7
keywords: smallprint printgap noloewdin
keywords: NOSOSCF
formula: C19H17Cl2N3O3
InChI: InChI=1S/C19H17Cl2N3O3/c1-13-9-25-19(27-13,10-24-12-22-11-23-24)17-7-6-16(8-18(17)21)26-15-4-2-14(20)3-5-15/h2-8,11-13H,9-10H2,1H3
44 atoms
Cl 0.756778 0.605784 2.416256
Cl -7.15288 1.998011 0.423558
O  3.93456 0.165558 -0.762847
O  3.331748 1.342119 1.04067
O  -2.250553 -0.569256 -1.492568
N  3.10006 -2.276317 0.68028
N  1.95481 -2.872406 1.025076
N  2.893083 -3.92602 -0.719461
C  3.084733 0.152359 0.353528
C  4.401384 1.498661 -0.993784
C  3.493851 -1.017586 1.258514
C  3.621359 2.304625 0.041278
C  1.633133 0.032429 -0.106563
C  5.902866 1.556357 -0.817917
C  0.543726 0.19808 0.745001
C  1.350243 -0.327087 -1.421091
C  -0.764512 0.02609 0.319883
C  0.056632 -0.49525 -1.878631
C  -1.002038 -0.320392 -1.00236
C  3.636371 -2.905868 -0.367404
C  1.87921 -3.852064 0.164251
C  -3.356131 0.064521 -0.987051
C  -4.493083 -0.707172 -0.800313
C  -3.380719 1.431153 -0.743077
C  -5.668372 -0.111568 -0.371488
C  -4.552431 2.025094 -0.301383
C  -5.687897 1.250851 -0.11966
H  4.130586 1.797611 -2.009191
H  3.029511 -0.940883 2.237818
H  4.574888 -1.003014 1.395696
H  4.19843 3.112986 0.488456
H  2.701942 2.723965 -0.380615
H  6.268471 2.555185 -1.057408
H  6.196338 1.324326 0.207415
H  6.402988 0.853947 -1.485344
H  2.16307 -0.476659 -2.116395
H  -1.577868 0.149536 1.02254
H  -0.12894 -0.767636 -2.908951
H  4.565922 -2.605702 -0.823187
H  1.05817 -4.551457 0.17862
H  -4.466105 -1.770423 -0.99921
H  -2.502777 2.044236 -0.900178
H  -6.556085 -0.712993 -0.232695
H  -4.574496 3.08927 -0.111842
elementType: Cl O N C H
totalener: -2044.68701899 hartree
nucrepener: 2764.10580482 hartree
electener: -4808.79282380 hartree
oneelecener: -8299.40818475 hartree
twoeener: 3490.61536094 hartree
cpcmener: -0.03311895 hartree
kineticenergy: 2038.70445166 hartree
xcener: -149.988096914241 hartree
chargesum: -0.0000000
charge: -0.081402 -0.101143 -0.407521 -0.368959 -0.328749 0.115060 -0.337132 -0.410113 0.576348 0.153670 -0.101282 0.016113 -0.212213 -0.299880 0.042942 -0.075261 -0.181614 -0.300071 0.307732 0.057233 0.059734 0.303095 -0.260673 -0.210011 -0.104270 -0.122741 0.061280 0.085023 0.131382 0.132468 0.111926 0.092175 0.096636 0.089152 0.094306 0.152071 0.134177 0.149814 0.169249 0.161385 0.152197 0.161394 0.147862 0.148613
qa: -0.0814 -0.1011 -0.4075 -0.3690 -0.3287 0.1151 -0.3371 -0.4101 0.5763 0.1537 -0.1013 0.0161 -0.2122 -0.2999 0.0429 -0.0753 -0.1816 -0.3001 0.3077 0.0572 0.0597 0.3031 -0.2607 -0.2100 -0.1043 -0.1227 0.0613 0.0850 0.1314 0.1325 0.1119 0.0922 0.0966 0.0892 0.0943 0.1521 0.1342 0.1498 0.1692 0.1614 0.1522 0.1614 0.1479 0.1486
va: 1.2429 1.2026 1.9634 2.0019 2.0807 3.3597 2.8852 3.0304 3.8565 3.8732 3.8481 3.9470 3.6671 3.9727 3.9481 3.8072 4.0108 4.1131 3.7440 4.0761 4.0420 3.6736 4.0497 3.9684 3.9417 3.9556 3.8419 0.9989 1.0267 1.0145 0.9930 1.0032 1.0064 1.0054 1.0054 1.0209 1.0224 1.0079 1.0080 0.9962 1.0053 0.9932 1.0011 1.0025
dispcorr: -0.025491325 hartree
energy: -2044.712510312335
dipole: 32.64783 -31.08614 1.56169 1.16627 0.68999 1.85626 -10.95644 10.12930 -0.82713
magnitude: 2.56295 au
magnitude: 6.51451 debye
