program: Gaussian 09
title: 000030177
version: EM64L-G09RevD.01
frameworkgroup: C1[X(C6H8O)]
method: RPBEPBE
basis: SDD
operation: Freq
keyword: #p
keyword: freq=noraman
keyword: PBEPBE/SDD
title: #p freq=noraman PBEPBE/SDD
converged: YES YES NO NO
title: Mulliken charges:
elementType: O C C C C C C H H H H H H H H
charge: -0.215336 0.305593 -0.211999 -0.734292 -0.149672 -0.204225 -0.562160 0.219003 0.239033 0.227782 0.240305 0.254418 0.166958 0.220083 0.204510
chargesum: 0.00000
title: Mulliken charges with hydrogens summed into heavy atoms:
elementType: O C C C C C C
charge: -0.215336 0.305593 0.007003 -0.027172 0.104746 -0.037267 -0.137568
polarizability: 9.34177950e+01 3.30960087e+00 8.48331747e+01 -1.99958701e-01 6.66387660e-01 3.37186247e+01
1716.lowfreq: -2.3642 -0.0007 -0.0003 -0.0002 6.8990 13.0896 46.8582 117.9893 153.1088
frequency: 46.6988 117.9330 153.0923 205.6156 222.8736 244.5438 382.7851 389.2666 536.7036 623.5777 688.0461 755.6798 862.8489 939.1358 964.0934 974.1380 1036.6118 1037.5724 1042.9955 1137.4277 1219.6176 1290.9415 1350.8240 1387.4181 1404.3163 1438.8934 1459.5764 1465.8425 1586.4870 1636.6500 1645.8809 2923.7169 2969.3856 3032.9467 3082.7815 3089.4361 3114.1295 3117.0925 3196.7662
redmass: 1.8931 1.2927 1.9924 2.4735 2.6629 4.6128 2.8290 2.2991 2.9288 4.3339 1.6208 3.2477 1.2741 1.3532 1.6090 1.7988 1.5097 1.2746 1.4941 2.5235 2.9735 1.2543 1.3144 1.3696 1.2054 1.2533 1.0495 1.1145 7.8543 5.0421 4.3158 1.0845 1.0401 1.0955 1.0889 1.0621 1.0953 1.0914 1.1128
irintensity: 0.0509 0.2548 5.5981 4.2072 4.2027 6.1968 5.0103 8.3582 6.4204 6.4227 0.4515 23.5119 18.8526 80.7880 20.0083 0.3795 3.5547 13.4195 5.0483 7.1150 39.4241 1.5293 30.5363 8.8007 5.1510 6.9266 16.0987 32.5215 159.9380 55.0437 14.2685 87.3590 19.3593 14.3170 4.2395 9.5547 34.7157 8.1252 18.6967
temp: 298.150 k
press: 1.00000 atm
elementType: 8 6 6 6 6 6 6 1 1 1 1 1 1 1 1
symmnumber: 1
zpe: 315660.7 jmol-1
zpe.correction: 0.120229 hartree
zpe.thermalcorrener: 0.128402 hartree
zpe.thermalcorrenthalpy: 0.129346 hartree
zpe.thermalcorrgfe: 0.087199 hartree
zpe.sumelectzpe: -308.076615 hartree
zpe.sumelectthermal: -308.068441 hartree
zpe.sumelectthermalent: -308.067497 hartree
zpe.sumelectthermalfe: -308.109645 hartree
dipole: -2.6861 -3.2843 0.0166
dipole: 4.2429
quadrupole: -36.5287 -46.9833 -44.5438
quadrupole: -2.6824 0.2379 0.2194
quadrupole: 6.1566 -4.2980 -1.8586 -2.6824 0.2379 0.2194
hfenergy: -308.1968435 hartree
pointgroup: C01 [X(C6H8O1)]
dipole: -0.459657 1.603822 0.0542335 debye
dipolederiv: -0.4428233 0.1319269 0.0060545 -0.0099805 -1.0999391 -0.0151353 0.0073543 -0.0235304 -0.3435255 0.0616568 -0.1339373 0.0096922 0.0862372 -0.7437957 -0.0220024 0.0123702 -0.0033982 0.008219 0.2074926 -0.3356129 -0.0376182 -0.0276045 0.3989439 -0.0073348 -0.0444863 0.0199827 -0.147949 -0.1930523 0.1404761 0.016765 0.2322918 -0.1158416 -0.0120772 0.0254879 -0.0048377 0.0620963 0.1394716 -0.001697 -0.0100945 -0.2539307 0.0285275 0.0391404 -0.0364894 0.0242972 -0.1128901 0.6011323 0.2115302 -0.0288916 0.038719 1.3855323 0.0234364 -0.0240083 0.0111655 0.1224258 -0.1535095 -0.1044319 -0.0278528 -0.1029251 0.0546867 0.079031 -0.0257526 0.0688803 -0.3903878 -0.0435974 -0.0954559 0.0163114 -0.0900798 -0.0307403 0.0099128 0.0144534 0.0040462 0.1171795 0.0237592 0.0589279 0.0108111 0.0073903 0.0580082 -0.1120234 0.0607832 -0.1332359 -0.02112 -0.0059599 -0.0586282 0.0106439 -0.1586685 -0.0282829 0.0165422 0.0109531 0.0072821 0.1094848 0.0141474 0.0807386 -0.0250496 0.0192694 0.0691098 0.1051984 -0.0704682 0.1187977 -0.0201761 0.0844844 0.0001338 0.0050588 0.1147022 -0.0009267 -0.0305384 0.0152088 -0.0213723 0.1586363 -0.2636452 -0.0084901 0.021588 0.071064 0.0484831 -0.0057185 0.0218236 -0.0058615 0.0987819 -0.1028625 0.0280458 0.0165104 0.0445308 0.0765739 -0.0200196 0.0186466 -0.0158443 0.184398 0.0733058 0.0864742 0.0160715 0.0289844 -0.1003392 -0.0484116 0.0141237 -0.0463714 0.1748269 unknown
polarizability: 89.6532783|-5.3408244|88.4898857|-1.2498402|2.3240095|33.8264303 unknown
InChI: InChI=1S/C6H8O/c1-3-6(4-2)5-7/h3-5H,1H2,2H3
charge 0 multiplicity 1
15 atoms
O  -0.348421 -2.390228 -0.02081
C  0.016416 0.01323 0.013995
C  -0.566202 1.263352 0.043594
C  -2.023802 1.636133 0.143983
C  1.482693 -0.213993 -0.070562
C  -0.819318 -1.219095 0.0399
C  2.469886 0.716628 0.030495
H  0.111964 2.128941 -0.016559
H  -2.186172 2.283834 1.028607
H  -2.709056 0.778493 0.220514
H  -2.323704 2.2396 -0.735751
H  1.75445 -1.26874 -0.213514
H  -1.921612 -1.069688 0.111312
H  3.522364 0.425525 -0.049781
H  2.274914 1.782907 0.203176
