program: Orca
programVersion: 4.2.1
elementType: Cl Cl O O O N N N C C C C C C C C C C C C C C C C C C C H H H H H H H H H H H H H H H H H
charge: 0
multiplicity: 1
keywords: wb97x-d3
keywords: def2-TZVPP
keywords: def2/J RIJCOSX GRIDX6 NOFINALGRIDX
keywords: grid4 nofinalgrid
keywords: scfconv7
keywords: smallprint printgap noloewdin
keywords: NOSOSCF
formula: C19H17Cl2N3O3
InChI: InChI=1S/C19H17Cl2N3O3/c1-13-9-25-19(27-13,10-24-12-22-11-23-24)17-7-6-16(8-18(17)21)26-15-4-2-14(20)3-5-15/h2-8,11-13H,9-10H2,1H3
44 atoms
Cl 1.876008 -0.021453 -2.753511
Cl -7.437846 2.477963 1.413095
O  3.239464 0.274037 -0.17183
O  2.378434 -0.58194 1.696694
O  -2.962095 0.200539 -1.602854
N  4.117749 -2.36727 0.311928
N  4.38704 -2.961518 1.477752
N  6.286847 -2.365325 0.440376
C  2.33096 -0.672988 0.305096
C  3.481915 1.257897 0.835144
C  2.773529 -2.07736 -0.108227
C  2.60632 0.784995 1.996651
C  0.919284 -0.41282 -0.217832
C  4.95765 1.31239 1.161248
C  0.633617 -0.109925 -1.547782
C  -0.166136 -0.523271 0.646924
C  -0.660528 0.118143 -1.985838
C  -1.471526 -0.31611 0.235847
C  -1.711865 0.018343 -1.088229
C  5.254579 -2.007004 -0.283026
C  5.693265 -2.939729 1.503513
C  -3.966188 0.731398 -0.83435
C  -5.232457 0.188968 -0.99397
C  -3.761135 1.811269 0.014321
C  -6.306881 0.73081 -0.306418
C  -4.832871 2.344072 0.713058
C  -6.098124 1.802188 0.547045
H  3.145318 2.23062 0.468197
H  2.716045 -2.186029 -1.189555
H  2.106719 -2.819218 0.326314
H  3.101669 0.850902 2.964724
H  1.666139 1.342046 2.049924
H  5.554264 1.495259 0.267192
H  5.151891 2.127354 1.859039
H  5.303034 0.385617 1.6224
H  0.005358 -0.786305 1.68131
H  -0.855916 0.363887 -3.021516
H  -2.278183 -0.424581 0.948307
H  5.286616 -1.510684 -1.239936
H  6.245703 -3.365098 2.327074
H  -5.385216 -0.649935 -1.660541
H  -2.779999 2.251634 0.13734
H  -7.294638 0.310235 -0.437345
H  -4.673183 3.184197 1.374571
elementType: Cl O N C H
totalener: -2044.68889554 hartree
nucrepener: 2696.93414470 hartree
electener: -4741.62304024 hartree
oneelecener: -8164.12494266 hartree
twoeener: 3422.50190242 hartree
cpcmener: -0.03365573 hartree
kineticenergy: 2038.70963749 hartree
xcener: -149.989594819303 hartree
chargesum: 0.0000000
charge: -0.081509 -0.101685 -0.376908 -0.378848 -0.331007 0.145918 -0.353969 -0.416340 0.595402 0.175963 -0.131368 -0.025804 -0.130299 -0.287045 0.000876 -0.131700 -0.232878 -0.221655 0.282736 0.050818 0.054814 0.310046 -0.263541 -0.210103 -0.104955 -0.127191 0.061703 0.077756 0.149551 0.131643 0.107771 0.101558 0.095345 0.110307 0.077385 0.153741 0.129146 0.158690 0.164019 0.160884 0.152506 0.161034 0.148483 0.148706
qa: -0.0815 -0.1017 -0.3769 -0.3788 -0.3310 0.1459 -0.3540 -0.4163 0.5954 0.1760 -0.1314 -0.0258 -0.1303 -0.2870 0.0009 -0.1317 -0.2329 -0.2217 0.2827 0.0508 0.0548 0.3100 -0.2635 -0.2101 -0.1050 -0.1272 0.0617 0.0778 0.1496 0.1316 0.1078 0.1016 0.0953 0.1103 0.0774 0.1537 0.1291 0.1587 0.1640 0.1609 0.1525 0.1610 0.1485 0.1487
va: 1.2368 1.2019 1.9973 1.9977 2.0787 3.3398 2.8924 3.0100 3.8654 3.8607 3.7766 3.9569 3.6251 3.9438 3.9973 3.9183 4.1283 3.9802 3.7801 4.0794 4.0517 3.6686 4.0476 3.9639 3.9450 3.9618 3.8395 1.0016 1.0131 1.0240 1.0003 0.9967 1.0081 1.0056 1.0036 1.0209 1.0281 0.9966 1.0071 0.9959 1.0050 0.9938 1.0008 1.0024
dispcorr: -0.024611890 hartree
energy: -2044.713507433196
dipole: 23.45426 -24.76293 -1.30866 -0.87638 2.05689 1.18051 9.82474 -9.78545 0.03929
magnitude: 1.76288 au
magnitude: 4.48089 debye
