program: Gaussian 09
title: 000030175
version: EM64L-G09RevD.01
frameworkgroup: C1[X(C7H12)]
method: RPBEPBE
basis: SDD
operation: Freq
keyword: #p
keyword: freq=noraman
keyword: PBEPBE/SDD
title: #p freq=noraman PBEPBE/SDD
converged: YES YES NO NO
title: Mulliken charges:
elementType: C C C C C C C H H H H H H H H H H H H
charge: -0.239561 -0.503142 -0.504126 0.402710 -0.815150 -0.316630 -0.735288 0.233936 0.227000 0.229425 0.237346 0.232677 0.217608 0.220599 0.232178 0.216211 0.217872 0.222135 0.224200
chargesum: 0.00000
title: Mulliken charges with hydrogens summed into heavy atoms:
elementType: C C C C C C C
charge: -0.005625 -0.046717 -0.034102 0.402710 -0.144766 -0.100419 -0.071081
polarizability: 8.97279483e+01 -7.78053594e+00 7.77174849e+01 4.87014675e-01 4.26435124e-01 5.67815910e+01
1716.lowfreq: -17.0260 -6.6632 -5.2324 -0.0003 0.0006 0.0008 64.5413 111.5543 130.1000
frequency: 64.2771 111.5465 130.0387 164.6741 200.3293 296.9955 326.8153 422.2157 488.4171 549.1055 702.9971 785.4786 814.1354 842.2927 872.3552 900.6159 953.8765 1014.7281 1025.6925 1038.0481 1041.0242 1060.0266 1065.3226 1096.5247 1130.9883 1166.9780 1178.3592 1229.7199 1329.8172 1377.5279 1389.4571 1399.7434 1437.8316 1462.5480 1465.9112 1467.3940 1468.8322 1478.5115 1694.4947 2963.7410 2966.4013 3031.5335 3034.0714 3071.8610 3079.1823 3090.5370 3092.6056 3101.6656 3103.6409 3189.4618 3208.0136
redmass: 2.3649 1.0299 1.0853 2.3423 2.6963 2.6116 2.6918 2.7620 2.7446 2.3646 2.3494 1.0766 1.1875 1.8710 2.0738 2.6075 1.8077 1.7486 1.3207 1.2177 1.5268 1.6289 1.2801 1.1670 2.2996 1.3967 2.6962 1.5366 1.3697 1.6906 1.4969 1.2038 1.0879 1.0468 1.0762 1.2858 1.0485 1.0797 6.5218 1.0381 1.0386 1.0969 1.0964 1.0855 1.0930 1.0542 1.0926 1.0912 1.0640 1.1170 1.1150
irintensity: 0.2611 1.1061 0.5919 1.6354 0.3279 0.7391 0.3952 1.5174 3.7640 5.6938 2.3504 1.6147 6.6271 21.9809 21.3705 2.2916 10.0944 13.8737 3.1491 25.9491 0.7611 17.2100 7.1296 0.9024 0.6769 1.6551 6.0193 8.2998 0.1954 1.3595 13.2965 14.0312 9.0775 1.8181 7.8476 2.9950 23.9937 15.5601 1.9594 56.6890 25.2036 20.8099 33.0040 20.9851 7.2867 16.5312 30.0186 51.5975 24.9480 0.4707 35.2867
temp: 298.150 k
press: 1.00000 atm
elementType: 6 6 6 6 6 6 6 1 1 1 1 1 1 1 1 1 1 1 1
symmnumber: 1
zpe: 440096.3 jmol-1
zpe.correction: 0.167624 hartree
zpe.thermalcorrener: 0.176207 hartree
zpe.thermalcorrenthalpy: 0.177151 hartree
zpe.thermalcorrgfe: 0.134564 hartree
zpe.sumelectzpe: -273.329228 hartree
zpe.sumelectthermal: -273.320645 hartree
zpe.sumelectthermalent: -273.319701 hartree
zpe.sumelectthermalfe: -273.362288 hartree
dipole: 0.0590 0.2356 -0.0010
dipole: 0.2429
quadrupole: -42.7555 -43.2233 -45.2377
quadrupole: -0.8749 1.6140 -0.3492
quadrupole: 0.9833 0.5155 -1.4989 -0.8749 1.6140 -0.3492
hfenergy: -273.4968517 hartree
pointgroup: C01 [X(C7H12)]
dipole: 0.0167964 0.0936914 -0.0084683 debye
dipolederiv: -0.0310646 -0.1226635 0.0903175 -0.0696623 0.0270291 0.0693259 0.1333315 0.0602337 0.09669 0.0153878 -0.0509048 0.051747 -0.0714891 -0.2092864 -0.0198963 0.0148512 -0.0161014 0.0775965 -0.0369462 0.0314352 0.1132977 0.0906828 -0.0396124 -0.0958407 0.0896101 -0.0811668 -0.0489888 0.2405484 0.0879715 -0.0024801 0.0013154 0.2642079 -0.0077091 0.100719 0.0186982 -0.158257 -0.0511219 -0.0385104 0.0024162 -0.0589529 -0.1371804 -0.0023676 -0.0204297 -0.0131654 0.1027887 0.1197859 -0.0489439 0.1203808 0.0560616 -0.0302451 0.0223257 0.0732592 0.0032949 -0.2491426 -0.1395208 0.0036598 -0.0481856 0.0708537 0.0316811 0.0030086 -0.0700482 -0.0052581 0.1186873 -0.047872 0.0075577 -0.0426342 -0.0220739 0.0520437 0.106794 -0.0705227 0.0964389 -0.0826073 0.0580848 0.1003338 -0.0806803 0.0406649 -0.0326784 0.0421924 -0.0637587 0.054793 0.0452003 -0.0163181 -0.0822081 -0.0997764 -0.0710025 0.0005225 -0.0449661 -0.1013468 -0.0714447 0.0270786 -0.1291673 0.1079516 -0.0050424 0.086965 0.0611931 -0.0174697 -0.0198797 -0.0028597 0.0571464 0.0665471 0.0066081 -0.0758013 0.0330877 0.0789701 -0.0511536 -0.0325931 -0.0580108 -0.0878308 -0.159373 -0.1118755 -0.0364669 -0.055993 0.0677175 -0.001797 -0.0465502 -0.0214702 0.089378 0.0898562 0.0322509 -0.0774469 0.0414756 0.0039558 0.0667342 -0.0585099 0.1316836 -0.0940615 0.0228017 0.0817622 0.1060391 0.0732528 -0.0013129 -0.0479555 0.100375 -0.1085746 -0.0152904 0.0135228 -0.0788422 -0.0343498 -0.0896763 -0.122221 -0.014726 -0.0305314 -0.0048655 0.1375779 0.0521887 -0.0459476 -0.0084278 -0.1379615 -0.1267286 -0.0259053 -0.0084767 -0.0101863 0.0950001 0.0022657 0.035924 -0.0396599 0.0199248 0.0545592 0.1089802 -0.1150954 0.1204336 -0.0931654 -0.0696052 0.0844413 0.0667534 0.0625272 0.0573851 -0.089574 0.1255965 -0.0924725 -0.0177999 unknown
polarizability: 90.7097475|-6.7736382|76.6131652|1.6471016|-1.4264053|56.9041115 unknown
InChI: InChI=1S/C7H12/c1-3-6(2)7-4-5-7/h3,7H,4-5H2,1-2H3
charge 0 multiplicity 1
19 atoms
C  -1.098715 0.06752 -0.482206
C  -1.813962 -1.20869 -0.028991
C  -2.159478 0.132324 0.641259
C  0.35103 0.356559 -0.181827
C  0.680118 1.83985 -0.144657
C  1.253064 -0.647341 0.020559
C  2.72761 -0.528795 0.339932
H  -1.439954 0.483117 -1.441518
H  -1.253597 -1.934828 0.566831
H  -2.55113 -1.655324 -0.702981
H  -3.126565 0.595487 0.422584
H  -1.796835 0.287992 1.66229
H  1.743974 2.044378 0.057403
H  0.42059 2.319455 -1.109528
H  0.076994 2.350622 0.631439
H  0.879707 -1.679242 -0.060092
H  3.070588 0.51672 0.414807
H  2.963909 -1.030578 1.299369
H  3.338751 -1.029627 -0.436874
