program: Orca
programVersion: 4.2.1
elementType: Cl Cl O O O N N N C C C C C C C C C C C C C C C C C C C H H H H H H H H H H H H H H H H H
charge: 0
multiplicity: 1
keywords: wb97x-d3
keywords: def2-TZVPP
keywords: def2/J RIJCOSX GRIDX6 NOFINALGRIDX
keywords: grid4 nofinalgrid
keywords: scfconv7
keywords: smallprint printgap noloewdin
keywords: NOSOSCF
formula: C19H17Cl2N3O3
InChI: InChI=1S/C19H17Cl2N3O3/c1-13-9-25-19(27-13,10-24-12-22-11-23-24)17-7-6-16(8-18(17)21)26-15-4-2-14(20)3-5-15/h2-8,11-13H,9-10H2,1H3
44 atoms
Cl 0.752852 0.53178 2.386213
Cl -7.134885 1.887656 0.543719
O  3.946126 0.256489 -0.802857
O  3.317258 1.365476 1.042238
O  -2.233791 -0.528434 -1.565297
N  3.038316 -2.241174 0.653214
N  3.582699 -2.788321 -0.436108
N  1.712609 -3.887388 0.14372
C  3.094942 0.195745 0.309867
C  4.531146 1.55874 -0.892945
C  3.500215 -0.993247 1.198396
C  3.692261 2.353216 0.096707
C  1.645429 0.072668 -0.159572
C  6.00364 1.502846 -0.54423
C  0.552275 0.189668 0.696786
C  1.365724 -0.242774 -1.486695
C  -0.753084 0.009611 0.266415
C  0.074069 -0.411001 -1.950083
C  -0.987385 -0.286296 -1.06823
C  1.919377 -2.89496 0.971602
C  2.757502 -3.767887 -0.696512
C  -3.342384 0.067442 -1.019526
C  -4.467769 -0.72521 -0.853495
C  -3.377943 1.420696 -0.710884
C  -5.642373 -0.163777 -0.378356
C  -4.548007 1.979509 -0.222276
C  -5.672008 1.1844 -0.05998
H  4.399523 1.926219 -1.912779
H  3.07354 -0.891002 2.193688
H  4.584037 -1.017365 1.30288
H  4.245545 3.13866 0.609674
H  2.812889 2.798241 -0.381173
H  6.457698 2.484383 -0.683177
H  6.162219 1.201796 0.492909
H  6.532638 0.800637 -1.189077
H  2.180553 -0.352402 -2.186489
H  -1.56656 0.090319 0.974908
H  -0.107778 -0.645789 -2.990315
H  1.308023 -2.632522 1.820951
H  2.92265 -4.436325 -1.526752
H  -4.432875 -1.777603 -1.102533
H  -2.508936 2.0503 -0.851324
H  -6.521479 -0.780926 -0.254649
H  -4.577529 3.032758 0.019895
elementType: Cl O N C H
totalener: -2044.68668611 hartree
nucrepener: 2768.60661080 hartree
electener: -4813.29329691 hartree
oneelecener: -8308.25071757 hartree
twoeener: 3494.95742065 hartree
cpcmener: -0.03467654 hartree
kineticenergy: 2038.71067254 hartree
xcener: -149.989853359250 hartree
chargesum: 0.0000000
charge: -0.075064 -0.100720 -0.403694 -0.370586 -0.328282 0.128660 -0.347397 -0.403790 0.576484 0.173704 -0.141572 0.011210 -0.142244 -0.304329 -0.038439 -0.102497 -0.144718 -0.279313 0.297322 0.068546 0.054289 0.303330 -0.260171 -0.211465 -0.103897 -0.122187 0.061516 0.087033 0.142686 0.123525 0.111280 0.091489 0.096123 0.089459 0.094079 0.146729 0.134547 0.150772 0.165817 0.160976 0.152453 0.161817 0.147841 0.148677
qa: -0.0751 -0.1007 -0.4037 -0.3706 -0.3283 0.1287 -0.3474 -0.4038 0.5765 0.1737 -0.1416 0.0112 -0.1422 -0.3043 -0.0384 -0.1025 -0.1447 -0.2793 0.2973 0.0685 0.0543 0.3033 -0.2602 -0.2115 -0.1039 -0.1222 0.0615 0.0870 0.1427 0.1235 0.1113 0.0915 0.0961 0.0895 0.0941 0.1467 0.1345 0.1508 0.1658 0.1610 0.1525 0.1618 0.1478 0.1487
va: 1.2485 1.2030 1.9704 1.9964 2.0833 3.3489 2.8957 3.0244 3.8469 3.8779 3.8941 3.9602 3.6298 3.9669 3.9990 3.8428 3.9689 4.0967 3.7662 4.0592 4.0601 3.6708 4.0500 3.9682 3.9408 3.9549 3.8422 0.9979 1.0106 1.0187 0.9931 1.0032 1.0071 1.0052 1.0066 1.0298 1.0218 1.0068 1.0005 0.9966 1.0051 0.9929 1.0011 1.0025
dispcorr: -0.025630357 hartree
energy: -2044.712316470891
dipole: 32.09886 -31.24576 0.85309 1.53159 0.33700 1.86858 -9.39133 9.27836 -0.11297
magnitude: 2.05722 au
magnitude: 5.22903 debye
