program: Orca
programVersion: 4.2.1
elementType: Cl Cl O O O N N N C C C C C C C C C C C C C C C C C C C H H H H H H H H H H H H H H H H H
charge: 0
multiplicity: 1
keywords: wb97x-d3
keywords: def2-TZVPP
keywords: def2/J RIJCOSX GRIDX6 NOFINALGRIDX
keywords: grid4 nofinalgrid
keywords: scfconv7
keywords: smallprint printgap noloewdin
keywords: NOSOSCF
formula: C19H17Cl2N3O3
InChI: InChI=1S/C19H17Cl2N3O3/c1-13-9-25-19(27-13,10-24-12-22-11-23-24)17-7-6-16(8-18(17)21)26-15-4-2-14(20)3-5-15/h2-8,11-13H,9-10H2,1H3
44 atoms
Cl 0.971953 1.725741 2.0645
Cl -6.940138 -0.366604 0.985053
O  4.061498 -0.141898 -0.639171
O  3.70889 1.277666 1.046511
O  -2.011851 0.891624 -1.925541
N  2.255116 -2.050883 0.771311
N  0.9447 -2.172285 1.006144
N  1.584895 -3.584814 -0.615919
C  3.145499 0.199334 0.366927
C  4.943897 0.963361 -0.871268
C  3.022715 -0.975437 1.348407
C  4.379466 2.036979 0.055908
C  1.786315 0.517919 -0.25174
C  6.366325 0.563143 -0.549743
C  0.751911 1.133331 0.450445
C  1.491175 0.054195 -1.529992
C  -0.514711 1.284113 -0.087611
C  0.225903 0.160884 -2.080792
C  -0.775919 0.772239 -1.349436
C  2.614629 -2.885836 -0.205554
C  0.593832 -3.100342 0.156647
C  -3.128756 0.581012 -1.194941
C  -3.140216 -0.421667 -0.233189
C  -4.287502 1.282797 -1.493848
C  -4.31703 -0.710045 0.440475
C  -5.465987 0.98592 -0.828853
C  -5.471408 -0.004594 0.140265
H  4.864185 1.266092 -1.917884
H  2.521977 -0.665557 2.262295
H  4.017001 -1.335801 1.611061
H  5.145875 2.642969 0.537273
H  3.685035 2.702914 -0.467031
H  6.675652 -0.30199 -1.136672
H  7.045414 1.382236 -0.788016
H  6.484847 0.322304 0.508145
H  2.260205 -0.434671 -2.110358
H  -1.288465 1.783249 0.481024
H  0.02324 -0.231515 -3.068204
H  3.626751 -2.967079 -0.56781
H  -0.422326 -3.457626 0.099646
H  -2.247895 -0.987906 0.002863
H  -4.273597 2.058863 -2.247629
H  -4.324339 -1.488435 1.190836
H  -6.366842 1.535193 -1.064695
elementType: Cl O N C H
totalener: -2044.68560922 hartree
nucrepener: 2802.75487284 hartree
electener: -4847.44048206 hartree
oneelecener: -8376.65630743 hartree
twoeener: 3529.21582537 hartree
cpcmener: -0.03109518 hartree
kineticenergy: 2038.71037604 hartree
xcener: -149.989192010876 hartree
chargesum: 0.0000000
charge: -0.079980 -0.102865 -0.407982 -0.367009 -0.333674 0.111231 -0.332913 -0.405916 0.573525 0.154177 -0.092977 0.011437 -0.191054 -0.296902 0.064447 -0.094127 -0.185873 -0.282796 0.284146 0.053685 0.063275 0.283383 -0.173580 -0.251115 -0.155169 -0.113733 0.075421 0.085198 0.129164 0.131640 0.111713 0.093255 0.093698 0.096501 0.088606 0.152588 0.133924 0.150226 0.170185 0.156821 0.154484 0.151518 0.145694 0.147723
qa: -0.0800 -0.1029 -0.4080 -0.3670 -0.3337 0.1112 -0.3329 -0.4059 0.5735 0.1542 -0.0930 0.0114 -0.1911 -0.2969 0.0644 -0.0941 -0.1859 -0.2828 0.2841 0.0537 0.0633 0.2834 -0.1736 -0.2511 -0.1552 -0.1137 0.0754 0.0852 0.1292 0.1316 0.1117 0.0933 0.0937 0.0965 0.0886 0.1526 0.1339 0.1502 0.1702 0.1568 0.1545 0.1515 0.1457 0.1477
va: 1.2436 1.2007 1.9667 2.0010 2.0713 3.3604 2.8679 3.0301 3.8808 3.8725 3.8507 3.9483 3.6844 3.9747 3.9137 3.8115 4.0297 4.1106 3.7340 4.0759 4.0348 3.6873 3.9205 4.0283 4.0064 3.9577 3.8255 0.9997 1.0252 1.0151 0.9934 1.0034 1.0056 1.0059 1.0055 1.0203 1.0208 1.0066 1.0081 0.9976 0.9959 1.0055 1.0047 1.0011
dispcorr: -0.026638178 hartree
energy: -2044.712247398650
dipole: 33.79174 -31.45237 2.33937 -0.20439 1.49547 1.29108 -10.39356 9.64086 -0.75269
magnitude: 2.77598 au
magnitude: 7.05599 debye
