program: Orca
programVersion: 4.2.1
elementType: Cl Cl O O O N N N C C C C C C C C C C C C C C C C C C C H H H H H H H H H H H H H H H H H
charge: 0
multiplicity: 1
keywords: wb97x-d3
keywords: def2-TZVPP
keywords: def2/J RIJCOSX GRIDX6 NOFINALGRIDX
keywords: grid4 nofinalgrid
keywords: scfconv7
keywords: smallprint printgap noloewdin
keywords: NOSOSCF
formula: C19H17Cl2N3O3
InChI: InChI=1S/C19H17Cl2N3O3/c1-13-9-25-19(27-13,10-24-12-22-11-23-24)17-7-6-16(8-18(17)21)26-15-4-2-14(20)3-5-15/h2-8,11-13H,9-10H2,1H3
44 atoms
Cl 0.299697 -1.494044 -1.393434
Cl -7.738497 0.149487 -0.744587
O  3.040642 -0.635144 -0.875323
O  3.54107 0.715246 0.826404
O  -2.441141 2.491462 0.111498
N  3.719404 -2.061618 1.46082
N  3.942793 -3.161606 0.73932
N  5.751321 -2.640924 1.952237
C  2.578309 -0.179138 0.357387
C  4.055642 0.237472 -1.368903
C  2.483251 -1.333685 1.358625
C  4.09524 1.34361 -0.315899
C  1.213509 0.49939 0.241216
C  5.360676 -0.512524 -1.522604
C  0.156657 -0.010229 -0.509491
C  0.965635 1.666128 0.961151
C  -1.076262 0.622769 -0.575299
C  -0.257966 2.307976 0.930893
C  -1.280058 1.78571 0.152661
C  4.807231 -1.758572 2.174746
C  5.168596 -3.476107 1.068156
C  -3.643769 1.877179 -0.101538
C  -4.538395 2.519852 -0.943606
C  -4.004533 0.703307 0.547019
C  -5.805015 1.992557 -1.138163
C  -5.266105 0.167903 0.34147
C  -6.158605 0.815735 -0.498308
H  3.738218 0.633744 -2.337314
H  1.703779 -2.034712 1.066944
H  2.218058 -0.936401 2.338859
H  5.103748 1.678718 -0.073925
H  3.502593 2.214669 -0.615687
H  6.103813 0.128945 -1.998817
H  5.761571 -0.832682 -0.559167
H  5.235669 -1.394923 -2.150947
H  1.749065 2.08679 1.576339
H  -1.858889 0.204045 -1.193926
H  -0.416821 3.211497 1.504715
H  4.859644 -0.911214 2.839832
H  5.662887 -4.343031 0.657799
H  -4.252046 3.437399 -1.440794
H  -3.321742 0.201171 1.220266
H  -6.502153 2.498647 -1.791687
H  -5.547123 -0.746003 0.846632
elementType: Cl O N C H
totalener: -2044.69847156 hartree
nucrepener: 2707.89527150 hartree
electener: -4752.59374306 hartree
oneelecener: -8186.37466710 hartree
twoeener: 3433.78092404 hartree
cpcmener: -0.03027269 hartree
kineticenergy: 2038.69712528 hartree
xcener: -149.986986089102 hartree
chargesum: 0.0000000
charge: -0.075566 -0.098852 -0.362517 -0.383641 -0.319497 0.128066 -0.337060 -0.409464 0.577352 0.176238 -0.112577 -0.026577 -0.129350 -0.291414 -0.023437 -0.115811 -0.181098 -0.270966 0.290165 0.052079 0.051170 0.301428 -0.258956 -0.212280 -0.102095 -0.122133 0.061284 0.075292 0.132804 0.141156 0.107356 0.101432 0.104071 0.077373 0.094250 0.151167 0.134037 0.148217 0.167170 0.158610 0.150134 0.159643 0.145769 0.147029
qa: -0.0756 -0.0989 -0.3625 -0.3836 -0.3195 0.1281 -0.3371 -0.4095 0.5774 0.1762 -0.1126 -0.0266 -0.1293 -0.2914 -0.0234 -0.1158 -0.1811 -0.2710 0.2902 0.0521 0.0512 0.3014 -0.2590 -0.2123 -0.1021 -0.1221 0.0613 0.0753 0.1328 0.1412 0.1074 0.1014 0.1041 0.0774 0.0942 0.1512 0.1340 0.1482 0.1672 0.1586 0.1501 0.1596 0.1458 0.1470
va: 1.2460 1.2046 2.0127 1.9835 2.0957 3.3755 2.8857 3.0136 3.8816 3.8799 3.7883 3.9566 3.6373 3.9569 4.0445 3.8922 3.9870 4.0655 3.7821 4.0620 4.0466 3.6856 4.0499 3.9667 3.9438 3.9598 3.8524 0.9993 1.0285 1.0062 0.9999 0.9972 1.0088 1.0065 1.0089 1.0208 1.0229 1.0088 1.0039 0.9976 1.0059 0.9932 1.0017 1.0030
dispcorr: -0.024756943 hartree
energy: -2044.723228502007
dipole: 32.37350 -32.63456 -0.26106 6.58778 -4.29303 2.29475 2.88195 -2.68279 0.19916
magnitude: 2.31812 au
magnitude: 5.89220 debye
