program: Gaussian 09
title: 000030236
version: EM64L-G09RevD.01
frameworkgroup: C1[X(C13H18O3)]
method: RPBEPBE
basis: SDD
operation: Freq
keyword: #pfreq=noraman
keyword: PBEPBE/SDD
title: #p freq=noraman PBEPBE/SDD
converged: YES YES NO NO
title: Mulliken charges:
elementType: O O O C C C C C C C C C C C C C H H H H H H H H H H H H H H H H H H
charge: -0.412376 -0.419961 -0.353251 -0.190956 -0.039396 0.410859 -0.753585 -0.731468 -0.709196 -0.061693 -0.382186 -0.031707 0.423392 -0.476338 -0.785612 0.154571 0.260342 0.191431 0.202308 0.228068 0.229300 0.213023 0.222741 0.212236 0.213988 0.205493 0.227816 0.236090 0.232534 0.241790 0.241336 0.219612 0.391605 0.389192
chargesum: 0.00000
title: Mulliken charges with hydrogens summed into heavy atoms:
elementType: O O O C C C C C C C C C C C C C
charge: -0.020771 -0.030769 -0.353251 0.069385 0.152035 0.410859 -0.093909 -0.083468 -0.061900 -0.061693 -0.146097 -0.031707 0.423392 -0.243805 -0.082875 0.154571
polarizability: 2.10004309e+02 1.80840344e+00 1.58799058e+02 -9.50891147e+00 3.68243901e+00 1.01517202e+02
1716.lowfreq: -10.2692 -0.0005 -0.0003 0.0004 7.4760 8.2884 25.9744 54.0262 62.5216
frequency: 25.0634 53.9992 62.5074 76.7311 126.6177 150.2553 162.9351 194.3154 214.2893 219.9618 230.2648 248.9344 255.2189 280.0941 311.6172 344.6638 358.3818 368.0892 393.1385 411.7084 439.5666 455.3615 511.1777 526.1977 559.8619 582.1844 607.6341 626.3093 681.5303 711.5813 729.1513 777.0661 788.7312 833.3613 857.5264 888.3318 911.6332 917.2278 950.6163 960.5154 962.3854 974.7933 1023.3308 1046.4850 1053.9947 1065.9941 1076.7107 1128.1126 1158.3461 1175.8125 1181.0054 1187.9245 1256.4532 1265.1302 1279.1094 1284.9284 1300.5611 1319.7847 1335.7265 1373.8492 1375.0014 1386.4206 1393.1771 1402.2326 1412.3679 1424.9201 1456.8480 1462.0984 1464.7276 1467.1763 1474.2271 1475.2076 1478.6473 1484.0160 1496.6707 1570.3866 1593.5646 1626.5500 2888.7301 2944.4413 2970.9260 2974.5609 2976.0608 2994.3121 3020.1332 3060.8009 3068.7014 3071.1309 3074.5154 3078.8090 3079.5559 3086.1792 3093.8937 3124.9141 3148.8420 3503.1169
redmass: 3.6271 4.2528 3.0224 3.6616 8.5583 3.6094 3.3308 1.1028 1.1342 1.0776 1.3496 2.6844 4.4018 4.1948 2.1854 3.1154 2.3570 3.9731 3.6159 2.7672 8.1100 2.9398 3.7095 4.4730 5.5452 1.7482 3.8101 1.9952 4.5857 5.2603 3.7696 4.5854 2.7465 1.4149 3.8150 1.0763 1.2322 1.9722 1.4190 1.3951 2.2502 1.2697 2.0554 1.5530 2.5446 1.8387 2.7587 2.3196 2.0122 1.7799 1.5525 2.1820 1.7861 2.3457 2.3043 1.8083 1.5555 1.8396 1.3736 1.2425 3.4650 1.2108 1.2247 1.7883 1.7469 2.0257 2.9878 1.0472 1.0642 1.0476 1.1464 1.0761 1.0507 1.0491 1.0489 3.8506 6.7722 3.5570 1.0710 1.0827 1.0359 1.0362 1.0366 1.0363 1.0843 1.0994 1.0990 1.0979 1.0997 1.0988 1.0965 1.0986 1.1009 1.0872 1.0958 1.0635
irintensity: 0.0220 1.0955 0.3050 0.1019 0.3110 1.3951 0.8115 0.0965 0.3551 0.1570 0.0760 0.6953 4.0706 0.3585 0.2809 0.5295 0.5697 6.4087 2.7196 0.1820 3.2183 2.1569 1.9713 6.3880 13.2598 46.7763 32.8234 98.4124 33.9550 4.6463 0.4331 4.7818 9.8111 24.8649 15.4902 130.9997 2.0313 5.4533 1.1649 1.6577 14.5749 7.1379 2.4437 9.2309 78.9391 236.3827 42.2455 3.1548 48.0258 24.9027 14.6978 45.9369 34.3361 1.2935 104.1366 3.4995 2.1313 9.0678 2.1225 5.9934 6.1815 23.3367 34.5985 182.3618 75.4127 166.8473 23.8279 12.1408 8.1216 8.1900 40.6137 6.4616 12.3679 18.8395 5.2229 36.0932 96.5920 137.9542 362.9269 20.1958 32.3300 51.1689 13.1884 23.1294 4.8323 8.3247 12.6794 91.1420 20.9929 75.9202 12.0768 36.1648 22.7915 13.7691 20.8010 65.6311
temp: 298.150 k
press: 1.00000 atm
elementType: 8 8 8 6 6 6 6 6 6 6 6 6 6 6 6 6 1 1 1 1 1 1 1 1 1 1 1 1 1 1 1 1 1 1
symmnumber: 1
zpe: 740839.3 jmol-1
zpe.correction: 0.282171 hartree
zpe.thermalcorrener: 0.298911 hartree
zpe.thermalcorrenthalpy: 0.299856 hartree
zpe.thermalcorrgfe: 0.238036 hartree
zpe.sumelectzpe: -730.664314 hartree
zpe.sumelectthermal: -730.647573 hartree
zpe.sumelectthermalent: -730.646629 hartree
zpe.sumelectthermalfe: -730.708448 hartree
dipole: -1.2138 1.8952 0.4117
dipole: 2.2879
quadrupole: -83.4611 -96.6355 -98.8886
quadrupole: 2.4438 -1.1949 -0.3785
quadrupole: 9.5340 -3.6405 -5.8935 2.4438 -1.1949 -0.3785
hfenergy: -730.9464844 hartree
pointgroup: C01 [X(C13H18O3)]
dipole: 0.4662413 -0.7556914 0.1475731 debye
polarizability: 210.1021698|0.8334237|158.8704257|9.1520987|-2.8404492|101.3479729 unknown
InChI: InChI=1S/C13H18O3/c1-7(2)9(4)10-6-5-8(3)11(12(10)14)13(15)16/h5-7,9,14-15H,1-4H3
charge 0 multiplicity 1
34 atoms
O  0.010519 1.941495 -0.47034
O  3.977272 0.671546 0.152949
O  2.474174 2.364699 -0.199057
C  -2.265867 0.25217 -0.612767
C  -3.191932 -0.005006 0.626892
C  -0.853923 -0.284563 -0.371426
C  -2.843353 -0.341203 -1.926542
C  -4.634382 0.501152 0.383121
C  -2.610875 0.654485 1.901657
C  0.266046 0.594377 -0.3115
C  -0.601197 -1.658824 -0.2084
C  1.611817 0.093971 -0.092658
C  1.827386 -1.322135 0.072402
C  0.702312 -2.167025 0.008991
C  3.188148 -1.953354 0.308338
C  2.672861 1.103202 -0.05392
H  -2.185237 1.348083 -0.737985
H  -3.237898 -1.103697 0.794295
H  -3.041665 -1.426112 -1.830512
H  -3.790654 0.152749 -2.203436
H  -2.133182 -0.200183 -2.760975
H  -4.631585 1.577414 0.122365
H  -5.140265 -0.046966 -0.431095
H  -5.244453 0.379324 1.297559
H  -2.544239 1.751725 1.774022
H  -3.255107 0.451427 2.777302
H  -1.597136 0.279877 2.129278
H  -1.441934 -2.361324 -0.252811
H  0.845505 -3.24599 0.130699
H  3.890762 -1.735473 -0.514481
H  3.666286 -1.568165 1.225555
H  3.0811 -3.047439 0.39969
H  0.902063 2.449447 -0.403788
H  4.564533 1.476716 0.150982
