program: Orca
programVersion: 4.2.1
elementType: Cl Cl O O O N N N C C C C C C C C C C C C C C C C C C C H H H H H H H H H H H H H H H H H
charge: 0
multiplicity: 1
keywords: wb97x-d3
keywords: def2-TZVPP
keywords: def2/J RIJCOSX GRIDX6 NOFINALGRIDX
keywords: grid4 nofinalgrid
keywords: scfconv7
keywords: smallprint printgap noloewdin
keywords: NOSOSCF
formula: C19H17Cl2N3O3
InChI: InChI=1S/C19H17Cl2N3O3/c1-13-9-25-19(27-13,10-24-12-22-11-23-24)17-7-6-16(8-18(17)21)26-15-4-2-14(20)3-5-15/h2-8,11-13H,9-10H2,1H3
44 atoms
Cl 2.435904 1.207847 -2.547802
Cl -7.175078 0.909649 1.78115
O  3.764421 1.191556 0.092009
O  2.974821 -0.169042 1.700859
O  -2.372156 0.437851 -1.533878
N  2.890687 -2.346315 -0.227408
N  2.005467 -2.738197 -1.146787
N  1.938494 -4.095797 0.631705
C  2.982761 0.053128 0.319958
C  4.329415 1.647962 1.321412
C  3.657057 -1.13901 -0.391057
C  4.122281 0.456514 2.241687
C  1.549977 0.227892 -0.151578
C  5.773305 2.039712 1.124404
C  1.221276 0.701348 -1.420223
C  0.493997 -0.175264 0.659587
C  -0.090532 0.793616 -1.851368
C  -0.826414 -0.11411 0.248174
C  -1.115907 0.3778 -1.015408
C  2.834586 -3.160317 0.830777
C  1.462248 -3.790342 -0.592299
C  -3.459183 0.546895 -0.710101
C  -3.534846 1.524311 0.273332
C  -4.522698 -0.313301 -0.93351
C  -4.680401 1.632376 1.044433
C  -5.674857 -0.197576 -0.171289
C  -5.742693 0.770442 0.817418
H  3.755182 2.509765 1.680321
H  4.657539 -1.293333 0.016957
H  3.765493 -0.951479 -1.456695
H  4.988045 -0.217886 2.238751
H  3.913753 0.738953 3.272975
H  6.366151 1.202686 0.751668
H  5.869065 2.869128 0.423586
H  6.203217 2.36243 2.073774
H  0.697549 -0.564859 1.646475
H  -0.320371 1.174933 -2.837557
H  -1.605879 -0.460251 0.91363
H  3.461603 -3.043211 1.700236
H  0.693815 -4.36264 -1.08842
H  -2.71261 2.207668 0.443644
H  -4.457582 -1.068702 -1.705873
H  -4.74061 2.392433 1.811325
H  -6.506309 -0.865976 -0.348456
elementType: Cl O N C H
totalener: -2044.69757270 hartree
nucrepener: 2738.52582386 hartree
electener: -4783.22339655 hartree
oneelecener: -8248.36746351 hartree
twoeener: 3465.14406696 hartree
cpcmener: -0.03045488 hartree
kineticenergy: 2038.69940278 hartree
xcener: -149.987662541762 hartree
chargesum: 0.0000000
charge: -0.079771 -0.098571 -0.372309 -0.382019 -0.321509 0.121781 -0.336826 -0.406760 0.547289 0.147586 -0.169793 0.010750 -0.079060 -0.279191 0.052295 -0.138605 -0.238889 -0.209648 0.284775 0.063483 0.058390 0.281654 -0.199349 -0.243528 -0.124269 -0.107342 0.066524 0.076034 0.128708 0.133056 0.076364 0.111113 0.079255 0.097298 0.096816 0.146864 0.127096 0.153413 0.166679 0.160225 0.158553 0.149983 0.145833 0.145621
qa: -0.0798 -0.0986 -0.3723 -0.3820 -0.3215 0.1218 -0.3368 -0.4068 0.5473 0.1476 -0.1698 0.0108 -0.0791 -0.2792 0.0523 -0.1386 -0.2389 -0.2096 0.2848 0.0635 0.0584 0.2817 -0.1993 -0.2435 -0.1243 -0.1073 0.0665 0.0760 0.1287 0.1331 0.0764 0.1111 0.0793 0.0973 0.0968 0.1469 0.1271 0.1534 0.1667 0.1602 0.1586 0.1500 0.1458 0.1456
va: 1.2406 1.2051 2.0158 1.9751 2.0870 3.3389 2.8837 3.0401 3.8771 3.9256 3.9282 3.9411 3.6167 3.9708 3.9538 3.9143 4.1514 3.9842 3.7820 4.0760 4.0420 3.6989 3.9709 4.0453 3.9580 3.9456 3.8488 0.9992 1.0042 1.0298 1.0017 0.9972 1.0073 1.0034 1.0050 1.0255 1.0281 0.9990 1.0025 0.9963 0.9947 1.0052 1.0032 1.0020
dispcorr: -0.024651538 hartree
energy: -2044.722224234959
dipole: 28.77143 -27.00900 1.76244 -0.24340 1.41153 1.16813 10.10913 -8.72002 1.38912
magnitude: 2.52989 au
magnitude: 6.43048 debye
