program: Gaussian 09
title: 000030172
version: EM64L-G09RevD.01
frameworkgroup: C1[X(C8H22N2O2Si)]
method: RPBEPBE
basis: SDD
operation: Freq
keyword: #p
keyword: freq=noraman
keyword: PBEPBE/SDD
title: #p freq=noraman PBEPBE/SDD
converged: YES YES NO NO
title: Mulliken charges:
elementType: Si O O N N C C C C C C C C H H H H H H H H H H H H H H H H H H H H H H
charge: 1.476009 -0.603016 -0.603073 -0.592842 -0.592747 -0.803223 -0.803200 -0.668493 -0.668400 -0.197480 -0.197459 -0.398367 -0.398304 0.245351 0.248279 0.245128 0.248364 0.223550 0.226541 0.216317 0.223495 0.226652 0.216284 0.177998 0.220859 0.177890 0.220992 0.217216 0.203009 0.217213 0.202948 0.264536 0.281758 0.264488 0.281727
chargesum: 0.00000
title: Mulliken charges with hydrogens summed into heavy atoms:
elementType: Si O O N N C C C C C C C C
charge: 1.476009 -0.603016 -0.603073 -0.046548 -0.046532 -0.309593 -0.309708 -0.002085 -0.001969 0.201377 0.201423 0.021858 0.021857
polarizability: 1.37659434e+02 9.64803001e-03 1.40252870e+02 7.38831796e+00 -2.46104511e-03 1.13419572e+02
1716.lowfreq: -5.8711 -0.0012 -0.0008 0.0012 6.5318 10.7718 18.3183 32.4315 46.3881
frequency: 18.2184 31.9211 46.2866 48.9936 56.3261 57.8670 70.7131 73.3120 116.8521 122.8642 133.7806 153.4673 172.6081 177.6728 181.7360 209.4087 235.1731 251.8783 253.6696 259.3052 263.9203 377.5510 377.9554 410.3491 433.6077 564.0952 565.8329 585.8781 680.7623 704.8859 752.5237 765.2448 767.1766 798.0987 798.3487 950.7698 951.4602 970.1760 983.1296 992.4849 997.2947 1018.5987 1022.7684 1033.5334 1037.3031 1067.2135 1070.5679 1111.4671 1112.2836 1154.2967 1154.7412 1230.6141 1231.7446 1253.1403 1253.8088 1257.0806 1259.0414 1286.0666 1287.7339 1333.8734 1334.0626 1385.5590 1387.0872 1394.2184 1396.5469 1441.2689 1441.4929 1473.0123 1476.7601 1484.3737 1484.7855 1485.3414 1486.7213 1487.8343 1489.2588 1641.3383 1641.4929 2922.0711 2922.2333 2931.3327 2931.4870 2975.5515 2975.6273 2991.7695 2991.8261 3012.2903 3014.0660 3040.6967 3041.8559 3055.8743 3056.4177 3067.7179 3068.0819 3072.3978 3073.7812 3485.2195 3485.4341 3614.1159 3614.3514
redmass: 4.2680 2.6819 1.8794 2.6048 2.0113 2.9358 4.1775 2.3476 2.7619 2.4457 2.3168 2.2702 1.8321 1.2849 1.1427 1.2616 1.8801 2.4135 2.6480 3.7568 3.6582 4.2209 3.5163 4.2429 4.7150 1.3216 1.3064 3.7500 1.8021 2.3372 2.6274 1.9937 4.8115 1.1012 1.1013 1.5208 1.5137 1.2349 1.2634 1.4002 1.5107 3.1304 3.0425 3.3122 3.2011 3.7968 4.2514 2.7471 2.7568 1.2801 1.2817 1.2473 1.2452 1.3171 1.3049 1.4495 1.4311 1.0894 1.0882 1.2537 1.2520 1.4377 1.4281 1.1883 1.1856 1.0792 1.0751 1.0732 1.0717 1.0502 1.0426 1.0555 1.0416 1.0835 1.0806 1.0950 1.0950 1.0702 1.0702 1.0622 1.0621 1.0351 1.0351 1.0600 1.0598 1.0965 1.0968 1.0994 1.0989 1.0953 1.0958 1.0998 1.0999 1.0998 1.0996 1.0452 1.0452 1.0984 1.0985
irintensity: 0.9576 1.4696 0.0982 0.0229 0.9236 0.1544 1.5456 1.2523 2.6804 0.3822 0.6338 5.5341 2.0664 17.9469 81.0283 1.8779 16.2153 21.2247 14.3165 0.8606 1.7229 1.3899 6.3718 32.3451 10.8266 145.2689 360.4470 0.0102 1.8031 3.6081 105.3318 96.0245 101.8128 2.0863 1.1046 16.5764 2.1935 13.9650 1.2066 13.7819 0.1078 267.6957 170.7953 48.0401 54.6989 103.9537 117.4947 3.4006 9.8740 5.0500 0.1300 4.0303 2.8821 4.2663 0.2246 7.5424 13.9428 7.4560 0.7283 8.5498 3.8649 0.6238 1.2605 11.1395 8.1188 39.1911 1.7487 0.6842 0.9592 19.1806 8.5182 9.9528 5.8281 4.2315 0.5988 71.3477 9.3968 76.9623 73.6923 80.6065 40.3746 41.3243 41.7066 24.8007 0.4842 31.2349 35.2803 1.8517 1.4409 48.7959 52.7509 86.4507 7.5084 39.5917 57.6887 0.3985 0.3944 1.6546 1.7156
temp: 298.150 k
press: 1.00000 atm
elementType: 14 8 8 7 7 6 6 6 6 6 6 6 6 1 1 1 1 1 1 1 1 1 1 1 1 1 1 1 1 1 1 1 1 1 1
symmnumber: 1
zpe: 794409.1 jmol-1
zpe.correction: 0.302574 hartree
zpe.thermalcorrener: 0.322705 hartree
zpe.thermalcorrenthalpy: 0.323650 hartree
zpe.thermalcorrgfe: 0.251066 hartree
zpe.sumelectzpe: -866.311692 hartree
zpe.sumelectthermal: -866.291561 hartree
zpe.sumelectthermalent: -866.290617 hartree
zpe.sumelectthermalfe: -866.363200 hartree
dipole: 0.0026 0.2790 -0.0025
dipole: 0.2790
quadrupole: -71.2695 -85.1544 -91.1734
quadrupole: 0.0126 0.4671 0.0085
quadrupole: 11.2630 -2.6219 -8.6410 0.0126 0.4671 0.0085
hfenergy: -866.6142666 hartree
pointgroup: C01[X(C8H22N2O2Si1)]
dipole: 0.001576 -0.1097528 0.0008878 debye
polarizability: 137.8031506|-0.013974|140.2527648|-7.147417|-0.0085737|113.2759597 unknown
InChI: InChI=1S/C8H22N2O2Si/c1-3-13(4-2,11-7-5-9)12-8-6-10/h3-10H2,1-2H3
charge 0 multiplicity 1
35 atoms
Si 0.007172 -1.035825 -0.000851
O  1.273167 -0.03435 0.650202
O  -1.270707 -0.047618 -0.648886
N  3.794684 2.664399 0.110198
N  -3.81545 2.628264 -0.104118
C  0.610044 -2.038075 -1.500987
C  -0.58341 -2.049684 1.496407
C  1.810566 -2.964246 -1.176088
C  -1.779268 -2.981906 1.171607
C  2.049641 0.936052 -0.126204
C  -2.053165 0.917081 0.128591
C  2.943973 1.714615 0.852251
C  -2.958937 1.68492 -0.847768
H  -0.239985 -2.628524 -1.894653
H  0.879827 -1.326206 -2.305493
H  0.271974 -2.636787 1.883469
H  -0.854359 -1.343643 2.305627
H  2.154684 -3.503833 -2.077539
H  2.667982 -2.388605 -0.780205
H  1.545761 -3.723213 -0.416043
H  -2.116405 -3.528065 2.071746
H  -2.641803 -2.40982 0.781797
H  -1.51265 -3.735478 0.406849
H  2.678156 0.410583 -0.879618
H  1.387485 1.641722 -0.66557
H  -2.673541 0.38735 0.885793
H  -1.395411 1.630043 0.663704
H  2.290868 2.282299 1.53893
H  3.502382 0.977618 1.473292
H  -2.314196 2.257268 -1.538467
H  -3.51301 0.941284 -1.464795
H  4.570233 2.239036 -0.403989
H  4.077405 3.496894 0.630438
H  -4.584054 2.196421 0.415103
H  -4.109551 3.456032 -0.625633
