program: Orca
programVersion: 4.2.1
elementType: Cl Cl O O O N N N C C C C C C C C C C C C C C C C C C C H H H H H H H H H H H H H H H H H
charge: 0
multiplicity: 1
keywords: wb97x-d3
keywords: def2-TZVPP
keywords: def2/J RIJCOSX GRIDX6 NOFINALGRIDX
keywords: grid4 nofinalgrid
keywords: scfconv7
keywords: smallprint printgap noloewdin
keywords: NOSOSCF
formula: C19H17Cl2N3O3
InChI: InChI=1S/C19H17Cl2N3O3/c1-13-9-25-19(27-13,10-24-12-22-11-23-24)17-7-6-16(8-18(17)21)26-15-4-2-14(20)3-5-15/h2-8,11-13H,9-10H2,1H3
44 atoms
Cl 0.011968 -1.129095 1.688397
Cl -7.439125 1.814487 0.980009
O  3.522211 0.040708 -0.896544
O  2.704686 -0.060634 1.194932
O  -2.573546 0.930176 -2.154294
N  3.938341 -2.453665 0.495044
N  5.123963 -2.446066 -0.118524
N  5.367385 -2.948116 2.050798
C  2.527868 -0.539134 -0.113323
C  4.024566 1.191171 -0.224513
C  2.724229 -2.06221 -0.168817
C  3.831598 0.797995 1.228798
C  1.136404 -0.168678 -0.613022
C  5.454444 1.43972 -0.630322
C  -0.02633 -0.380214 0.123623
C  0.982843 0.398689 -1.875547
C  -1.280043 -0.024929 -0.351265
C  -0.251568 0.773375 -2.371468
C  -1.387048 0.568016 -1.601078
C  4.099518 -2.745076 1.788707
C  5.94875 -2.751011 0.850059
C  -3.680968 1.122852 -1.371243
C  -4.830427 0.419629 -1.692862
C  -3.679714 2.040914 -0.329547
C  -5.995056 0.637135 -0.972497
C  -4.83859 2.248868 0.400308
C  -5.988583 1.546033 0.072888
H  3.40625 2.064818 -0.467883
H  2.762069 -2.393837 -1.205744
H  1.893945 -2.577942 0.310018
H  4.709706 0.27573 1.626925
H  3.616321 1.650242 1.874199
H  6.079673 0.570882 -0.421369
H  5.531971 1.675127 -1.691865
H  5.853158 2.290192 -0.076357
H  1.855563 0.565555 -2.491141
H  -2.153609 -0.219946 0.255879
H  -0.333409 1.2217 -3.352925
H  3.276829 -2.806684 2.483814
H  7.011186 -2.841827 0.68414
H  -4.822953 -0.291251 -2.508925
H  -2.787094 2.601848 -0.082809
H  -6.893849 0.092161 -1.226746
H  -4.839917 2.962683 1.212702
elementType: Cl O N C H
totalener: -2044.69926603 hartree
nucrepener: 2706.84541407 hartree
electener: -4751.54468010 hartree
oneelecener: -8184.24389695 hartree
twoeener: 3432.69921685 hartree
cpcmener: -0.02841782 hartree
kineticenergy: 2038.69786447 hartree
xcener: -149.987644775424 hartree
chargesum: 0.0000000
charge: -0.078707 -0.096933 -0.383266 -0.377284 -0.317593 0.139181 -0.352614 -0.406928 0.582150 0.145228 -0.157499 0.022787 -0.108352 -0.285279 -0.054569 -0.092732 -0.167986 -0.267930 0.292248 0.064108 0.057056 0.266130 -0.230234 -0.198001 -0.114112 -0.124279 0.072687 0.084715 0.130139 0.146286 0.074498 0.107431 0.081735 0.098620 0.098010 0.149861 0.127973 0.147899 0.162189 0.159678 0.150750 0.160557 0.145989 0.146392
qa: -0.0787 -0.0969 -0.3833 -0.3773 -0.3176 0.1392 -0.3526 -0.4069 0.5822 0.1452 -0.1575 0.0228 -0.1084 -0.2853 -0.0546 -0.0927 -0.1680 -0.2679 0.2922 0.0641 0.0571 0.2661 -0.2302 -0.1980 -0.1141 -0.1243 0.0727 0.0847 0.1301 0.1463 0.0745 0.1074 0.0817 0.0986 0.0980 0.1499 0.1280 0.1479 0.1622 0.1597 0.1508 0.1606 0.1460 0.1464
va: 1.2444 1.2066 2.0083 1.9890 2.0946 3.3517 2.8922 3.0322 3.8226 3.8532 3.8279 3.9536 3.6392 3.9813 4.0755 3.8795 3.9602 4.0590 3.7825 4.0637 4.0377 3.7064 4.0444 3.9780 3.9502 3.9568 3.8470 1.0002 1.0247 1.0137 0.9953 1.0003 1.0095 1.0014 1.0045 1.0213 1.0272 1.0094 1.0046 0.9969 1.0044 0.9934 1.0022 1.0030
dispcorr: -0.024533972 hartree
energy: -2044.723800004713
dipole: 32.54909 -33.18900 -0.63991 3.98341 -2.71648 1.26693 -8.34309 7.47056 -0.87253
magnitude: 1.66610 au
magnitude: 4.23489 debye
