program: Orca
programVersion: 4.2.1
elementType: Cl Cl O O O N N N C C C C C C C C C C C C C C C C C C C H H H H H H H H H H H H H H H H H
charge: 0
multiplicity: 1
keywords: wb97x-d3
keywords: def2-TZVPP
keywords: def2/J RIJCOSX GRIDX6 NOFINALGRIDX
keywords: grid4 nofinalgrid
keywords: scfconv7
keywords: smallprint printgap noloewdin
keywords: NOSOSCF
formula: C19H17Cl2N3O3
InChI: InChI=1S/C19H17Cl2N3O3/c1-13-9-25-19(27-13,10-24-12-22-11-23-24)17-7-6-16(8-18(17)21)26-15-4-2-14(20)3-5-15/h2-8,11-13H,9-10H2,1H3
44 atoms
Cl 2.03947 1.304378 3.036779
Cl -6.653714 0.658735 -2.918708
O  3.370595 -0.047685 -1.056526
O  3.78058 1.345763 0.652245
O  -2.509165 0.444431 1.212442
N  2.972272 -2.225579 0.820193
N  1.982622 -2.637325 1.615628
N  2.178602 -3.992756 -0.154781
C  3.098204 0.173533 0.291691
C  3.604003 1.223152 -1.657781
C  3.684874 -1.002293 1.08505
C  4.276883 1.974186 -0.51897
C  1.597399 0.30943 0.528413
C  4.443388 1.060373 -2.898265
C  1.044935 0.781912 1.716949
C  0.704961 -0.133675 -0.441839
C  -0.323184 0.843524 1.917423
C  -0.667956 -0.099203 -0.266272
C  -1.181014 0.400253 0.921323
C  3.074452 -3.039074 -0.23467
C  1.537161 -3.697426 0.993593
C  -3.436673 0.494527 0.207428
C  -4.491141 -0.403046 0.259472
C  -3.370154 1.449864 -0.798274
C  -5.490792 -0.348797 -0.699935
C  -4.360624 1.495883 -1.765381
C  -5.414111 0.595616 -1.710462
H  2.64703 1.695839 -1.912673
H  3.633434 -0.812448 2.154404
H  4.733619 -1.12862 0.814466
H  5.367409 1.879693 -0.561897
H  4.021413 3.034852 -0.508796
H  5.394618 0.575972 -2.673864
H  3.923288 0.472892 -3.6549
H  4.654768 2.038399 -3.331512
H  1.087174 -0.533535 -1.370631
H  -0.727068 1.223494 2.846597
H  -1.312133 -0.47245 -1.050939
H  3.806728 -2.905521 -1.015117
H  0.722926 -4.286882 1.385721
H  -4.538462 -1.140407 1.050404
H  -2.55636 2.162647 -0.835722
H  -6.315269 -1.047122 -0.657057
H  -4.308667 2.237489 -2.550609
elementType: Cl O N C H
totalener: -2044.69838376 hartree
nucrepener: 2750.08343950 hartree
electener: -4794.78182326 hartree
oneelecener: -8271.26621817 hartree
twoeener: 3476.48439491 hartree
cpcmener: -0.02935531 hartree
kineticenergy: 2038.70224268 hartree
xcener: -149.988036082647 hartree
chargesum: -0.0000000
charge: -0.080757 -0.098338 -0.392343 -0.376450 -0.321725 0.110669 -0.336568 -0.405838 0.617209 0.089352 -0.121142 0.063384 -0.125104 -0.271965 -0.000709 -0.129287 -0.223271 -0.220933 0.285844 0.063652 0.058299 0.282209 -0.240082 -0.201839 -0.108271 -0.122986 0.066832 0.083983 0.128170 0.129413 0.074608 0.091185 0.080907 0.098754 0.097823 0.149060 0.126190 0.152481 0.168060 0.160412 0.149683 0.158220 0.145242 0.145966
qa: -0.0808 -0.0983 -0.3923 -0.3765 -0.3217 0.1107 -0.3366 -0.4058 0.6172 0.0894 -0.1211 0.0634 -0.1251 -0.2720 -0.0007 -0.1293 -0.2233 -0.2209 0.2858 0.0637 0.0583 0.2822 -0.2401 -0.2018 -0.1083 -0.1230 0.0668 0.0840 0.1282 0.1294 0.0746 0.0912 0.0809 0.0988 0.0978 0.1491 0.1262 0.1525 0.1681 0.1604 0.1497 0.1582 0.1452 0.1460
va: 1.2401 1.2052 1.9898 2.0040 2.0883 3.3615 2.8788 3.0364 3.7792 3.9354 3.8902 3.9379 3.6529 3.9646 4.0026 3.8668 4.1395 4.0050 3.7800 4.0684 4.0437 3.6962 4.0446 3.9741 3.9462 3.9566 3.8475 0.9962 1.0289 1.0162 0.9966 0.9949 1.0105 1.0018 1.0032 1.0214 1.0280 0.9997 1.0047 0.9962 1.0051 0.9950 1.0021 1.0032
dispcorr: -0.024791792 hartree
energy: -2044.723175551009
dipole: 24.92577 -23.64977 1.27599 0.10465 1.38372 1.48837 -11.27930 9.90626 -1.37305
magnitude: 2.39346 au
magnitude: 6.08370 debye
